Peptide,PTM,ModifiedAA,ModifiedPosition,PeptideUniqueToGene,ExperimentDesc,ExpID,PubmedID,ScoreType,IdentScore,LocProb,Log2FChange,PQ-val,QuantSig,PEP,MassErrorPPM
MDSRDSLSSDAVRD,nta,M,1,true,"Arabidopsis translation initiation landscape - NTA",167a,35069635,,,,,,,,
MDSRDSLSSDAVR,ph,S,6,true,"Tissue atlas Arabidopsis - ProteomicsDB",114,32188942,"MaxQuant score",209.8900000,0.9996170,,,,7.5084094055759E-40,
TALSYFQSGK,ph,S,41,true,"Tissue atlas Arabidopsis - ProteomicsDB",114,32188942,"MaxQuant score",59.8400000,0.8871540,,,,0.013634200207889,
AFGVGFGSHEENGSTMQLSSNQVSR,ph,S,216,true,"Tissue atlas Arabidopsis - ProteomicsDB",114,32188942,"MaxQuant score",188.4700000,0.9999710,,,,0,
TSSLLSSSVASDTLR,ph,T,218,true,"srk2dei ABA signaling phopshoproteomics",83,23572148,"MASCOT Score",93.0000000,,,,,,-0.0003000
TSSLLSSSVASDTLR,ph,T,218,true,"Lateral root-induction - NAA vs control",106,23328941,"MASCOT Score",41.0000000,,,,,,
TSSLLSSSVASDTLR,ph,S,220,true,"Mitochondrial phosphoproteome",32,19688752,"MASCOT Score",55.0600000,,,,,,13.9264000
TSSLLSSSVASDTLR,ph,S,220,true,"Tyrosine phosphorylation in Arabidopsis",59,18463617,"MASCOT Score",92.0000000,,,,,,-0.7487136
TSSLLSSSVASDTLR,ph,S,220,true,"srk2dei ABA signaling phopshoproteomics",83,23572148,"MASCOT Score",90.0000000,,,,,,-0.0007000
TSSLLSSSVASDTLR,ph,S,220,true,"LAXIC - ABA stress",84a,23660473,XCorr,4.4600000,0.9020000,,,,0.0012296199565753,
TSSLLSSSVASDTLR,ph,S,220,true,"LAXIC - mannitol vs control",84b,23660473,XCorr,3.5300000,0.8970000,1.0417654,,NO,3.7000001611887E-5,
TSSLLSSSVASDTLR,ph,S,220,true,"SnRK2 protein kinase substrates",85,23776212,XCorr,3.5979600,0.8760000,,,,5.9467297752747E-10,
TSSLLSSSVASDTLR,ph,S,220,true,"atm and atr DNA damage response",88,25561503,"MASCOT Score",85.0000000,0.9960000,,,,,-0.1000000
TSSLLSSSVASDTLR,ph,S,220,true,"Brassinosteroid-Regulated Phosphorylation Dynamics",94,26187819,"MaxQuant Score",103.8800000,0.9900000,,,,0.0020000000949949,-5.7190000
TSSLLSSSVASDTLR,ph,S,220,true,"Lateral root-induction - NAA vs control",106,23328941,"MASCOT Score",50.0000000,,,,,,
TSSLLSSSVASDTLR,ph,S,220,true,"Phospho cell culture sucrose/TOR",109,30833711,,,0.9808840,,,,,
TSSLLSSSVASDTLR,ph,S,220,true,"Col-0 callus - FC Col-0 vs. Col-0 Xray",111a,31410901,,77.8600000,,1.7740057,0.0000000,NO,,2.0772031
TSSLLSSSVASDTLR,ph,S,220,true,"Col-0 X-ray callus - FC Col-0 vs. Col-0 Xray",111b,31410901,,77.8600000,,1.7740057,0.0000000,NO,,2.0772031
TSSLLSSSVASDTLR,ph,S,220,true,"atm callus - FC atm vs. atm Xray",111c,31410901,,77.8600000,,1.1641926,0.0000000,NO,,2.0772031
TSSLLSSSVASDTLR,ph,S,220,true,"atm-3 X-ray callus - FC atm vs. atm Xray",111d,31410901,,77.8600000,,1.1641926,0.0000000,NO,,2.0772031
TSSLLSSSVASDTLR,ph,S,220,true,"Tissue atlas Arabidopsis - ProteomicsDB",114,32188942,"MaxQuant score",188.5900000,0.9999340,,,,5.3055598226665E-26,
TSSLLSSSVASDTLR,ph,S,220,true,"Touch-induced phosphorylation: 40s touch vs untouc",136,30291188,"MASCOT score",109.8100000,,1.3950796,0.1776897,NO,,1.7493633
TSSLLSSSVASDTLR,ph,S,223,true,"Tissue atlas Arabidopsis - ProteomicsDB",114,32188942,"MaxQuant score",183.5800000,0.9530210,,,,3.2704698946647E-25,
TSSLLSSSVASDTLR,ph,S,224,true,"Tissue atlas Arabidopsis - ProteomicsDB",114,32188942,"MaxQuant score",218.2100000,0.9593410,,,,0,
TSSLLSSSVASDTLR,ph,S,225,true,"Tissue atlas Arabidopsis - ProteomicsDB",114,32188942,"MaxQuant score",125.3300000,0.8792750,,,,2.7171799956704E-6,
TSSLLSSSVASDTLR,ph,S,228,true,"Tissue atlas Arabidopsis - ProteomicsDB",114,32188942,"MaxQuant score",156.6700000,0.7691900,,,,3.3365101046595E-12,
TSSLLSSSVASDTLR,ph,T,230,true,"LAXIC - mannitol vs control",84b,23660473,XCorr,3.4800000,0.8600000,,,,0.01052809972316,
SCSSLR,sno,C,391,false,"hot5-4 / wildtype, FAT-switch S-nitrosoproteome",169,37277371,,,,,,,,
EGSSSDHEEGNTNTDSK,ph,S,551,true,"atm and atr DNA damage response",88,25561503,"MASCOT Score",45.0000000,0.8960000,,,,,-0.8100000
EGSSSDHEEGNTNTDSK,ph,S,552,true,"atm and atr DNA damage response",88,25561503,"MASCOT Score",59.0000000,0.9120000,,,,,-0.1800000
EGSSSDHEEGNTNTDSK,ph,S,552,true,"Tissue atlas Arabidopsis - ProteomicsDB",114,32188942,"MaxQuant score",353.5500000,0.8927400,,,,0,
EGSSSDHEEGNTNTDSK,ph,S,553,true,"atm and atr DNA damage response",88,25561503,"MASCOT Score",59.0000000,0.9120000,,,,,-0.1800000
EGSSSDHEEGNTNTDSK,ph,S,553,true,"Tissue atlas Arabidopsis - ProteomicsDB",114,32188942,"MaxQuant score",353.5500000,0.9824770,,,,0,
HTSSDCEETLDPSTGNTR,ph,S,685,true,"Tissue atlas Arabidopsis - ProteomicsDB",114,32188942,"MaxQuant score",160.0900000,0.7826640,,,,1.4302200177822E-21,
QCTHVSFVPGR,so,C,771,true,"Arabidopsis S-sulfenylation chemoproteomics",108,31578252,"pFind PSM Score",0.0745624,,,,,,-0.9000844
QCTHVSFVPGR,so,C,771,true,"S-sulfenylation site detection using YAP1C",110,32714340,,,,,,,,
