Peptide,PTM,ModifiedAA,ModifiedPosition,PeptideUniqueToGene,ExperimentDesc,ExpID,PubmedID,ScoreType,IdentScore,LocProb,Log2FChange,PQ-val,QuantSig,PEP,MassErrorPPM
ATSGGLGVTCSGGDKILVANRGE,nt,A,62,true,"N-terminal ChaFRADIC",92,26010716,"MASCOT Score",20.1400000,,,,,7.2749998025756E-7,
ATSGGLGVTCSGGDKILVANRGE,nt,A,62,true,"Stromal N-terminome",96,26371235,"MASCOT Score",40.3200000,,,,,,
ATSGGLGVTCSGGDKILVANR,nt,A,62,true,"N-terminal ChaFRADIC",92,26010716,"MASCOT Score",34.1200000,,,,,1.4750000445929E-5,
ATSGGLGVTCSGGDKILVANR,nt,A,62,true,"Stromal N-terminome",96,26371235,"MASCOT Score",64.1900000,,,,,,
ATSGGLGVTCSGGDKILVANRGE,nta,A,62,true,"N-terminal ChaFRADIC",92,26010716,"MASCOT Score",20.1400000,,,,,7.2749998025756E-7,
ATSGGLGVTCSGGDKILVANR,nta,A,62,true,"N-terminal ChaFRADIC",92,26010716,"MASCOT Score",34.1200000,,,,,1.4750000445929E-5,
ATSGGLGVTCSGGDK,ph,T,63,true,"Tissue atlas Arabidopsis - ProteomicsDB",114,32188942,"MaxQuant score",70.1190000,0.9208340,,,,0.0014922099653631,
ATSGGLGVTCSGGDK,ph,S,64,true,"Tissue atlas Arabidopsis - ProteomicsDB",114,32188942,"MaxQuant score",138.6800000,0.9995980,,,,6.6885098704006E-7,
SGGDKILVANRGEIAVR,nt,S,72,true,"Arg/N-end rule pathway Roots",80,25728785,"MASCOT Score",22.3200000,,,,,0.064190000295639,
SGGDKILVANRGEIAVR,nt,S,72,true,"Arabidopsis translation initiation landscape - NT",167b,35069635,,,,,,,,
SGGDKILVANRGE,nt,S,72,true,"N-terminal ChaFRADIC",92,26010716,"MASCOT Score",30.9600000,,,,,5.1540000640671E-6,
SGGDKILVANR,nt,S,72,true,"Arg/N-end rule pathway Roots",80,25728785,"MASCOT Score",58.8200000,,,,,0.00084150000475347,
SGGDKILVANR,nt,S,72,true,"N-terminal ChaFRADIC",92,26010716,"MASCOT Score",23.7700000,,,,,5.4860001910129E-6,
SGGDKILVANR,nt,S,72,true,"Arg/N-end rule seed, prt6 vs. Wt",99,29168982,"MASCOT Score",23.1000000,,-0.1573823,0.0899196,NO,0.0042860000394285,-1.1393348
SGGDKILVANR,nt,S,72,true,"FtsH12 N-terminome: WT / FtsH12 knockdown miRNA",118,33216923,"MaxQuant score",246.3000000,,0.1320952,0.4088716,NO,0,
VLSAAISR,nt,V,138,true,"Arg/N-end rule seed, prt6 vs. Wt",99,29168982,"MASCOT Score",37.5400000,,-0.8281241,0.1033304,NO,0.055750001221895,0.1478978
ALFVEMCR,nt,A,161,true,"Arabidopsis translation initiation landscape - NT",167b,35069635,,,,,,,,
VMGDKATAR,ub,K,188,true,"Arabidopsis ubiquitination COFRADIC",40,26744219,"MaxQuant Score",52.5790000,1.0000000,,,,0.014999999664724,-1.3370000
ATARETMK,mox,M,195,true,"cat2 Methionine oxidation - 1h stress",62a,25693801,"MASCOT Score",54.0000000,,0.1524500,,NO,,
ATARETMK,mox,M,195,true,"cat2 Methionine oxidation - 3h stress",62b,25693801,"MASCOT Score",45.0000000,,-0.0198827,,NO,,
ATAGGGGRGMRLAK,mox,M,240,true,"cat2 Methionine oxidation - 3h stress",62b,25693801,"MASCOT Score",33.0000000,,0.0153414,,NO,,
EPGEFVKLLQQAK,ac,K,251,true,"Histone deacetylases substrates - hda14 vs WT",98e,29061669,"MaxQuant Score",107.1000000,1.0000000,0.6150000,0.1028016,NO,2.7000000542635E-13,
SEAAAAFGNDGCYLEK,sno,C,269,true,"Site-specific nitrosomeproteomic id - gsnor1-3",90a,25699590,XCorr,3.7876370,,,,,2.6360000902059E-6,-4.4404827
SEAAAAFGNDGCYLEK,sno,C,269,true,"Site-specific nitrosomeproteomic id - gsnor1-3",90b,25699590,XCorr,3.9466517,,,,,0.013380000367761,-6.7690769
SEAAAAFGNDGCYLEK,so,C,269,true,"S-sulfenylation site detection using YAP1C",110,32714340,,,,,,,,
DCSIQR,sno,C,301,true,"hot5-4 / wildtype, FAT-switch S-nitrosoproteome",169,37277371,,,,,,,,
SVDLIEEQIR,nt,S,377,true,"Arg/N-end rule seed, prt6 vs. Wt",99,29168982,"MASCOT Score",43.8100000,,0.0958986,0.3618258,NO,0.026389999315143,-1.4069335
YKQEDIVLR,ac,K,396,true,"Quantitative Acetylproteomics",101,29440448,,,,,,,,
YKQEDIVLR,ub,K,396,true,"Arabidopsis ubiquitination COFRADIC",40,26744219,"MaxQuant Score",62.4630000,1.0000000,,,,0.0020000000949949,-0.7670000
GHSIECR,sno,C,409,true,"hot5-4 / wildtype, FAT-switch S-nitrosoproteome",169,37277371,,,,-0.6158929,0.1221376,NO,,
GHSIECR,so,C,409,true,"S-sulfenylation site detection using YAP1C",110,32714340,,,,,,,,
SDYVVPPSYDSL,nt,S,446,true,"N-terminal ChaFRADIC",92,26010716,"MASCOT Score",32.4300000,,,,,3.6710000131279E-5,
SDYVVPPSYD,nt,S,446,true,"N-terminal ChaFRADIC",92,26010716,"MASCOT Score",22.8100000,,,,,0.011649999767542,
AIERMK,mox,M,475,false,"cat2 Methionine oxidation - 1h stress",62a,25693801,"MASCOT Score",32.0000000,,0.1546424,,NO,,
AIERMK,mox,M,475,false,"cat2 Methionine oxidation - 3h stress",62b,25693801,"MASCOT Score",37.0000000,,0.0010816,,NO,,
