Peptide,PTM,ModifiedAA,ModifiedPosition,PeptideUniqueToGene,ExperimentDesc,ExpID,PubmedID,ScoreType,IdentScore,LocProb,Log2FChange,PQ-val,QuantSig,PEP,MassErrorPPM
AVQRSSSPNEDRGENQLVVYDLK,ph,S,12,true,"TOR Kinase and ABA Receptor",100,29290610,XCorr,3.3152051,0.8712000,,,,0.058070000261068,
SSSPNEDRGENQLVVYDLK,ph,S,12,true,"Tissue atlas Arabidopsis - ProteomicsDB",114,32188942,"MaxQuant score",108.7100000,0.8247730,,,,9.1996898987645E-10,
AVQRSSSPNEDRGENQLVVYDLK,ph,S,13,true,"TOR Kinase and ABA Receptor",100,29290610,XCorr,3.3152051,0.8712000,,,,0.058070000261068,
SSSPNEDRGENQLVVYDLK,ph,S,13,true,"Col-0 callus - FC Col-0 vs. Col-0 Xray",111a,31410901,,37.1800000,,0.4149249,0.0000000,NO,,1.6789906
SSSPNEDRGENQLVVYDLK,ph,S,13,true,"Col-0 X-ray callus - FC Col-0 vs. Col-0 Xray",111b,31410901,,37.1800000,,0.4149249,0.0000000,NO,,1.6789906
SSSPNEDRGENQLVVYDLK,ph,S,13,true,"atm callus - FC atm vs. atm Xray",111c,31410901,,37.1800000,,1.5037221,0.0000000,NO,,1.6789906
SSSPNEDRGENQLVVYDLK,ph,S,13,true,"atm-3 X-ray callus - FC atm vs. atm Xray",111d,31410901,,37.1800000,,1.5037221,0.0000000,NO,,1.6789906
SSSPNEDRGENQLVVYDLK,ph,S,14,true,"STN8 phosphoproteome",38,21768351,"MASCOT Score",46.7100000,,,,,,-0.4242410
SSSPNEDRGENQLVVYDLK,ph,S,14,true,"Phosphoproteome iron-deficient Arabidopsis roots",41,22438062,"MASCOT Score",38.6500000,,,,,,
SSSPNEDRGENQLVVYDLK,ph,S,14,true,"Tyrosine phosphorylation in Arabidopsis",59,18463617,"MASCOT Score",31.0000000,,,,,,-0.7178128
SSSPNEDRGENQLVVYDLK,ph,S,14,true,"srk2dei ABA signaling phopshoproteomics",83,23572148,"MASCOT Score",59.0000000,,,,,,-0.0006000
SSSPNEDRGENQLVVYDLK,ph,S,14,true,"atm and atr DNA damage response",88,25561503,"MASCOT Score",32.0000000,0.8890000,,,,,-0.0400000
SSSPNEDRGENQLVVYDLK,ph,S,14,true,"Protein sumoylation and phosphorylation cross-talk",97,28419593,,,,,,,,
SSSPNEDRGENQLVVYDLK,ph,S,14,true,"TOR Kinase and ABA Receptor",100,29290610,XCorr,3.1724808,0.9175000,,,,0.00010309999925084,
SSSPNEDRGENQLVVYDLK,ph,S,14,true,"Phospho cell culture sucrose/TOR",109,30833711,,,0.9913570,,,,,
SSSPNEDRGENQLVVYDLK,ph,S,14,true,"Col-0 callus - FC Col-0 vs. Col-0 Xray",111a,31410901,,54.4000000,,0.4721522,0.0000000,NO,,0.6256767
SSSPNEDRGENQLVVYDLK,ph,S,14,true,"Col-0 X-ray callus - FC Col-0 vs. Col-0 Xray",111b,31410901,,54.4000000,,0.4721522,0.0000000,NO,,0.6256767
SSSPNEDRGENQLVVYDLK,ph,S,14,true,"atm callus - FC atm vs. atm Xray",111c,31410901,,54.4000000,,0.3970623,0.0000000,NO,,0.6256767
SSSPNEDRGENQLVVYDLK,ph,S,14,true,"atm-3 X-ray callus - FC atm vs. atm Xray",111d,31410901,,54.4000000,,0.3970623,0.0000000,NO,,0.6256767
SSSPNEDRGENQLVVYDLK,ph,S,14,true,"Tissue atlas Arabidopsis - ProteomicsDB",114,32188942,"MaxQuant score",198.9500000,0.9999800,,,,0,
GNDDTEEEVLPVQSQPLSSR,ph,T,35,true,"atm and atr DNA damage response",88,25561503,"MASCOT Score",24.0000000,1.0000000,,,,,-0.9900000
GNDDTEEEVLPVQSQPLSSR,ph,T,35,true,"Col-0 callus - FC Col-0 vs. Col-0 Xray",111a,31410901,,75.8100000,,1.8962628,0.0000000,NO,,1.9382699
GNDDTEEEVLPVQSQPLSSR,ph,T,35,true,"Col-0 X-ray callus - FC Col-0 vs. Col-0 Xray",111b,31410901,,75.8100000,,1.8962628,0.0000000,NO,,1.9382699
GNDDTEEEVLPVQSQPLSSR,ph,T,35,true,"atm callus - FC atm vs. atm Xray",111c,31410901,,75.8100000,,1.8420512,0.0000000,NO,,1.9382699
GNDDTEEEVLPVQSQPLSSR,ph,T,35,true,"atm-3 X-ray callus - FC atm vs. atm Xray",111d,31410901,,75.8100000,,1.8420512,0.0000000,NO,,1.9382699
GNDDTEEEVLPVQSQPLSSR,ph,T,35,true,"Tissue atlas Arabidopsis - ProteomicsDB",114,32188942,"MaxQuant score",169.3900000,1.0000000,,,,1.030030024356E-34,
GNDDTEEEVLPVQSQPLSSR,ph,S,44,true,"Tissue atlas Arabidopsis - ProteomicsDB",114,32188942,"MaxQuant score",147.5100000,0.9962170,,,,3.4283800277597E-24,
LLDSIDNTNTPVAK,ph,T,214,true,"Col-0 callus - FC Col-0 vs. Col-0 Xray",111a,31410901,,79.0400000,,-0.4917454,0.0000000,NO,,1.0850710
LLDSIDNTNTPVAK,ph,T,214,true,"Col-0 X-ray callus - FC Col-0 vs. Col-0 Xray",111b,31410901,,79.0400000,,-0.4917454,0.0000000,NO,,1.0850710
LLDSIDNTNTPVAK,ph,T,214,true,"atm callus - FC atm vs. atm Xray",111c,31410901,,79.0400000,,-3.7678943,0.0000000,NO,,1.0850710
LLDSIDNTNTPVAK,ph,T,214,true,"atm-3 X-ray callus - FC atm vs. atm Xray",111d,31410901,,79.0400000,,-3.7678943,0.0000000,NO,,1.0850710
LLDSIDNTNTPVAK,ph,T,214,true,"Tissue atlas Arabidopsis - ProteomicsDB",114,32188942,"MaxQuant score",305.1000000,0.9999990,,,,0,
TSTLSIFGSNDELADR,ph,S,265,true,"atm and atr DNA damage response",88,25561503,"MASCOT Score",42.0000000,1.0000000,,,,,-0.2000000
TSTLSIFGSNDELADR,ph,S,265,true,"Tissue atlas Arabidopsis - ProteomicsDB",114,32188942,"MaxQuant score",231.8600000,0.9999820,,,,0,
