Peptide,PTM,ModifiedAA,ModifiedPosition,PeptideUniqueToGene,ExperimentDesc,ExpID,PubmedID,ScoreType,IdentScore,LocProb,Log2FChange,PQ-val,QuantSig,PEP,MassErrorPPM
TSPGSKKVVTTDDGSE,nt,T,2,true,"Arg/N-end rule seed, prt6 vs. Wt",99,29168982,"MASCOT Score",43.6200000,,,,,0.00010240000119666,-1.2693703
TSPGSKKVVTTDDGSE,nta,T,2,true,"Arg/N-end rule seed, prt6 vs. Wt",99,29168982,"MASCOT Score",43.6200000,,-0.3425844,0.1804865,NO,0.00010240000119666,-1.2693703
KVVTTDDGSEK,ph,S,16,true,"Tissue atlas Arabidopsis - ProteomicsDB",114,32188942,"MaxQuant score",186.0500000,1.0000000,,,,1.4584899382512E-14,
KVSGNLGK,ph,S,21,true,"Pollen phosphoproteome Arabidopsis",43,22631563,"MASCOT Score",43.5800000,,,,,,-1.1368800
KVSGNLGK,ph,S,21,true,"atm and atr DNA damage response",88,25561503,"MASCOT Score",36.0000000,1.0000000,,,,,-2.5000000
KVSGNLGK,ph,S,21,true,"Tissue atlas Arabidopsis - ProteomicsDB",114,32188942,"MaxQuant score",100.8200000,1.0000000,,,,0.0037889699451625,
VSFSGDLNHSGSHSGSHSR,ph,S,28,true,"Tissue atlas Arabidopsis - ProteomicsDB",114,32188942,"MaxQuant score",128.8700000,0.9534780,,,,5.0773997636393E-35,
VSFSGDLNHSGSHSGSHSR,ph,S,30,true,"Tissue atlas Arabidopsis - ProteomicsDB",114,32188942,"MaxQuant score",158.8900000,0.9998390,,,,1.7085399396411E-22,
VSFSGDLNHSGSHSGSHSR,ph,S,36,true,"TOR Kinase and ABA Receptor",100,29290610,XCorr,2.5795872,0.8243000,,,,0.068159997463226,
VSFSGDLNHSGSHSGSHSR,ph,S,36,true,"Tissue atlas Arabidopsis - ProteomicsDB",114,32188942,"MaxQuant score",131.4300000,0.8391840,,,,1.992030062496E-15,
VSFSGDLNHSGSHSGSHSR,ph,S,38,true,"atm and atr DNA damage response",88,25561503,"MASCOT Score",28.0000000,0.9920000,,,,,0.0000000
VSFSGDLNHSGSHSGSHSR,ph,S,38,true,"Tissue atlas Arabidopsis - ProteomicsDB",114,32188942,"MaxQuant score",201.2900000,0.9960000,,,,0,
VSFSGDLNHSGSHSGSHSR,ph,S,40,true,"Tissue atlas Arabidopsis - ProteomicsDB",114,32188942,"MaxQuant score",139.2800000,0.8766360,,,,5.6371599062814E-16,
VSFSGDLNHSGSHSGSHSR,ph,S,44,true,"atm and atr DNA damage response",88,25561503,"MASCOT Score",63.0000000,0.9880000,,,,,-0.4900000
IGHEYCNLR,so,C,77,true,"Arabidopsis S-sulfenylation chemoproteomics",108,31578252,"pFind PSM Score",0.2868450,,1.3698600,,,,-1.9564529
QQAEYALSR,ph,S,173,true,"Tissue atlas Arabidopsis - ProteomicsDB",114,32188942,"MaxQuant score",100.0900000,1.0000000,,,,0.0011755300220102,
TKLSMEANIDLEGHRPR,ph,S,183,true,"Tissue atlas Arabidopsis - ProteomicsDB",114,32188942,"MaxQuant score",67.1100000,0.9256730,,,,0.00020867299463134,
LIRIGQGPESLLR,ph,S,216,true,"Phosphorylation Early Elicitor Signaling",23,17317660,,,,,,,,
QSSTLVNDVR,ph,S,221,true,"Lateral root-induction - NAA vs control",106,23328941,"MASCOT Score",24.0000000,,,,,,
QSSTLVNDVR,ph,S,221,true,"Tissue atlas Arabidopsis - ProteomicsDB",114,32188942,"MaxQuant score",124.0400000,0.9996680,,,,0.00010273799853167,
QSSTLVNDVR,ph,S,222,true,"Phosphorylation Early Elicitor Signaling",23,17317660,,,,,,,,
QSSTLVNDVR,ph,S,222,true,"Tyrosine phosphorylation in Arabidopsis",59,18463617,"MASCOT Score",28.0000000,,,,,,-0.5010278
QSSTLVNDVR,ph,S,222,true,"Conserved plant phosphoproteome - Arabidopsis",61a,20466843,"MASCOT Score",33.0000000,1.0000000,,,,,
QSSTLVNDVR,ph,S,222,true,"srk2dei ABA signaling phopshoproteomics",83,23572148,"MASCOT Score",73.0000000,,,,,,0.0004000
QSSTLVNDVR,ph,S,222,true,"LAXIC - ABA stress",84a,23660473,XCorr,2.3800000,0.8650000,,,,0.0023415700998157,
QSSTLVNDVR,ph,S,222,true,"atm and atr DNA damage response",88,25561503,"MASCOT Score",55.0000000,0.9520000,,,,,-0.2600000
QSSTLVNDVR,ph,S,222,true,"Phospho cell culture sucrose/TOR",109,30833711,,,0.8532430,,,,,
QSSTLVNDVR,ph,S,222,true,"Tissue atlas Arabidopsis - ProteomicsDB",114,32188942,"MaxQuant score",163.0900000,0.9996040,,,,4.466770064937E-7,
QSSTLVNDVR,ph,T,223,true,"Pollen phosphoproteome Arabidopsis",43,22631563,"MASCOT Score",52.1600000,,,,,,
QSSTLVNDVR,ph,T,223,true,"Tyrosine phosphorylation in Arabidopsis",59,18463617,"MASCOT Score",23.0000000,,,,,,-0.5010278
QSSTLVNDVR,ph,T,223,true,"srk2dei ABA signaling phopshoproteomics",83,23572148,"MASCOT Score",22.0000000,,,,,,-0.0001000
YETSATVVQSK,ph,S,452,true,"Tissue atlas Arabidopsis - ProteomicsDB",114,32188942,"MaxQuant score",125.3600000,0.9875390,,,,1.3746200238529E-5,
NVSWAIASLSLKRPK,ph,S,520,true,"Arabidopsis root NAA phosphoproteome",18a,27643528,"MaxQuant Score",48.9070000,0.9300000,,,,0.00049950001994148,0.1610000
NVSWAIASLSLKRPK,ph,S,520,true,"Tissue atlas Arabidopsis - ProteomicsDB",114,32188942,"MaxQuant score",136.0400000,0.9985520,,,,3.8040698768782E-7,
NVSWAIASLSLK,ph,S,520,true,"TOR Kinase and ABA Receptor",100,29290610,XCorr,4.3791938,1.0000000,,,,3.8030000268918E-6,
