Peptide,PTM,ModifiedAA,ModifiedPosition,PeptideUniqueToGene,ExperimentDesc,ExpID,PubmedID,ScoreType,IdentScore,LocProb,Log2FChange,PQ-val,QuantSig,PEP,MassErrorPPM
ASLSLSSAHFSSTSSSSR,ph,S,3,true,"srk2dei ABA signaling phopshoproteomics",83,23572148,"MASCOT Score",35.0000000,,,,,,-0.0015000
ASLSLSSAHFSSTSSSSR,ph,S,5,true,"srk2dei ABA signaling phopshoproteomics",83,23572148,"MASCOT Score",35.0000000,,,,,,-0.0015000
RLSFSVIPR,ph,S,53,true,"atm and atr DNA damage response",88,25561503,"MASCOT Score",25.0000000,0.9920000,,,,,0.4300000
RLSFSVIPR,ph,S,53,true,"Tissue atlas Arabidopsis - ProteomicsDB",114,32188942,"MaxQuant score",71.0850000,0.9989410,,,,0.0063672601245344,
GTQCELIVHK,so,C,96,true,"Arabidopsis S-sulfenylation chemoproteomics",108,31578252,"pFind PSM Score",0.1040650,,1.1377600,,,,0.8779080
AEVSSGTDIGKR,ac,K,126,true,"Quantitative Acetylproteomics",101,29440448,,,,,,,,
IYHIKNYPPESDEIK,ac,K,216,true,"Quantitative Acetylproteomics",101,29440448,,,,,,,,
LVTRPDDTEEKVK,ac,K,239,true,"Histone deacetylases- hda14 vs WT (low light)",98c,29061669,"MaxQuant Score",70.4700000,1.0000000,0.1180000,0.9931160,NO,0.0049999998882413,
ASPVQDKWR,ac,K,302,true,"Histone deacetylases substrates - hda14 vs WT",98e,29061669,"MaxQuant Score",138.0000000,1.0000000,4.7380000,0.0492040,YES,1.0999999721918E-26,
ASPVQDKWR,ac,K,302,true,"Quantitative Acetylproteomics",101,29440448,,,,,,,,
