Peptide,PTM,ModifiedAA,ModifiedPosition,PeptideUniqueToGene,ExperimentDesc,ExpID,PubmedID,ScoreType,IdentScore,LocProb,Log2FChange,PQ-val,QuantSig,PEP,MassErrorPPM
SNGEAIGAWNYTNAESFIR,ng,N,41,true,"Conserved N-glycosylation",74,22633491,"MaxQuant Score",162.3200000,1.0000000,,,,2.2660397466597E-41,0.2620000
AENSLNATTR,ng,N,130,true,"Conserved N-glycosylation",74,22633491,"MaxQuant Score",153.0000000,1.0000000,,,,1.0709999997971E-8,-2.0900000
AENSLNATTR,ng,N,130,true,"N-glycan occupancy Arabidopsis glycoproteins",87,23994444,"Ladder score",61.4000000,,,,,,
SLKNIIKNSSTK,ng,N,173,true,"Conserved N-glycosylation",74,22633491,"MaxQuant Score",93.9790000,1.0000000,,,,0.00016310000501107,1.2790000
SYTHCAR,sno,C,276,true,"hot5-4 / wildtype, FAT-switch S-nitrosoproteome",169,37277371,,,,,,,,
GITVLLMNLDNTTTVVAK,ng,N,292,true,"Open search Plant PTM Viewer 2.0 - N-glycosylation",164a,TBA,,,,,,,,
GGPNGVIQRE,nt,G,326,true,"Arg/N-end rule seed, prt6 vs. Wt",99,29168982,"MASCOT Score",32.6000000,,-0.1576211,0.0573034,NO,0.00030960000003688,-0.2494245
GGPNGVIQR,nt,G,326,true,"Arg/N-end rule seed, prt6 vs. Wt",99,29168982,"MASCOT Score",29.7600000,,0.0301501,0.8009150,NO,0.12720000743866,-0.6052898
NVVVPACA,sno,C,400,true,"hot5-4 / wildtype, FAT-switch S-nitrosoproteome",169,37277371,,,,,,,,
