Peptide,PTM,ModifiedAA,ModifiedPosition,PeptideUniqueToGene,ExperimentDesc,ExpID,PubmedID,ScoreType,IdentScore,LocProb,Log2FChange,PQ-val,QuantSig,PEP,MassErrorPPM
SEWPAVDIPLDHHVF,nt,S,31,true,"Arg/N-end rule pathway Roots",80,25728785,"MASCOT Score",33.3400000,,,,,0.00016579999646638,
SEWPAVDIPLDHHVF,nt,S,31,true,"Arg/N-end rule seed, prt6 vs. Wt",99,29168982,"MASCOT Score",22.8000000,,-0.6569851,0.0235558,NO,0.014639999717474,-6.4110976
SEWPAVDIPLDHH,nt,S,31,true,"N-terminal ChaFRADIC",92,26010716,"MASCOT Score",51.9400000,,,,,2.0970000846887E-8,
SEWPAVDIPLDHH,nt,S,31,true,"Arg/N-end rule seed, prt6 vs. Wt",99,29168982,"MASCOT Score",33.1600000,,0.0699454,0.5753856,NO,0.0046109999530017,-4.0278294
SEWPAVDIPLDH,nt,S,31,true,"Arg/N-end rule seed, prt6 vs. Wt",99,29168982,"MASCOT Score",37.0900000,,0.0790523,0.8085021,NO,0.03745000064373,-4.5837013
SEWPAVDIPLD,nt,S,31,true,"HUNTER N-terminome: legumain, GluC and trypsin",119,31951383,"MaxQuant score",71.2230000,,,,,,
EWPAVDIPLDHH,nt,E,32,true,"N-terminal ChaFRADIC",92,26010716,"MASCOT Score",31.9600000,,,,,1.9950000478275E-6,
YEFVAQGTYHNYTFYKYK,ng,N,103,true,"N-Glycopeptide Profiling in Arabidopsis Infloresce",132,27067053,"MOWSE score",30.5000000,,,,,0.0015999999595806,
YEFVAQGTYHNYTFYK,ng,N,103,true,"Conserved N-glycosylation",74,22633491,"MaxQuant Score",170.0400000,1.0000000,,,,0,-0.3720000
YEFVAQGTYHNYTFYK,ng,N,103,true,"ER-associatied N-glycan degradation chilling stres",133,27558752,,,,,,,,
YEFVAQGTYHNYTFYK,ng,N,103,true,"N-linked Glycan Micro-heterogeneity Arabidopsis",134,29237727,,,,,,,,
YEFVAQGTYHNYTFYK,ng,N,103,true,"UDP-GlcNAc transporter glycopeptide analysis",135,30224661,,,,,,,4.4314348062379E-14,0.2000000
SGFIHHCLVSDLEHDTK,ox,C,117,true,"SPEAR - 10 mM H2O2 / mock",138a,34619326,,,,2.0465632,0.0288634,YES,,
SGFIHHCLVSDLEHDTK,ox,C,117,true,"SPEAR - 50 mM H2O2 / mock",138b,34619326,,,,2.0702156,0.0169901,YES,,
HVPIYNSNE,nt,H,312,true,"Arg/N-end rule seed, prt6 vs. Wt",99,29168982,"MASCOT Score",30.9800000,,-0.2393504,0.5781346,NO,0.0071600000374019,0.4081994
ISNVRYNVSSGDRYPVPDK,ng,N,365,true,"N-Glycopeptide Profiling in Arabidopsis Infloresce",132,27067053,"MOWSE score",41.5000000,,,,,0.00014000000373926,
YNVSSGDRYPVPDK,ng,N,365,true,"Conserved N-glycosylation",74,22633491,"MaxQuant Score",167.2300000,1.0000000,,,,1.5709999575858E-30,0.1010000
YNVSSGDRYPVPDK,ng,N,365,true,"N-glycan occupancy Arabidopsis glycoproteins",87,23994444,"Ladder score",72.8000000,,,,,,
YNVSSGDRYPVPDK,ng,N,365,true,"ER-associatied N-glycan degradation chilling stres",133,27558752,,,,,,,,
YNVSSGDRYPVPDK,ng,N,365,true,"N-linked Glycan Micro-heterogeneity Arabidopsis",134,29237727,,,,,,,,
YNVSSGDRYPVPDK,ng,N,365,true,"UDP-GlcNAc transporter glycopeptide analysis",135,30224661,,,,,,,9.9235825448945E-14,0.7000000
QEGLAGRFTEPQPD,nt,Q,391,true,"HUNTER N-terminome: legumain, GluC and trypsin",119,31951383,"MaxQuant score",95.6180000,,,,,,
EASYGHSTLDIKNR,ng,N,422,true,"Conserved N-glycosylation",74,22633491,"MaxQuant Score",116.9500000,1.0000000,,,,4.8560000465159E-9,-0.1810000
EASYGHSTLDIKNR,ng,N,422,true,"N-Glycopeptide Profiling in Arabidopsis Infloresce",132,27067053,"MOWSE score",36.0000000,,,,,0.00018000000272878,
