Peptide,PTM,ModifiedAA,ModifiedPosition,PeptideUniqueToGene,ExperimentDesc,ExpID,PubmedID,ScoreType,IdentScore,LocProb,Log2FChange,PQ-val,QuantSig,PEP,MassErrorPPM
AVAMSSGQTKER,nt,A,45,true,"Arabidopsis translation initiation landscape - NT",167b,35069635,,,,,,,,
AVAMSSGQTKE,nt,A,45,true,"Arg/N-end rule seed, prt6 vs. Wt",99,29168982,"MASCOT Score",58.1100000,,-0.1061620,0.6249425,NO,3.6120000324047E-9,-2.3222598
AVAMSSGQTKER,nta,A,45,true,"FtsH12 N-terminome: WT / FtsH12 knockdown miRNA",118,33216923,"MaxQuant score",53.8950000,,,,,9.5499999588355E-6,
AVAMSSGQTKER,nta,A,45,true,"Arabidopsis translation initiation landscape - NTA",167a,35069635,,,,,,,,
AVAMSSGQTK,nta,A,45,true,"Characterization plant N-terminal acetylation",6,22223895,"MASCOT Score",60.5500000,,,,,,
ERLELKK,ac,K,60,true,"Quantitative Acetylproteomics",101,29440448,,,,,,,,
SSAYLSVEQACIHR,sno,C,132,true,"Site-specific nitrosomeproteomic id - gsnor1-3",90b,25699590,XCorr,3.0200000,,,,,0.0017450000159442,-7.7700000
SSAYLSVEQACIHR,so,C,132,true,"Arabidopsis S-sulfenylation chemoproteomics",108,31578252,"pFind PSM Score",0.0312248,,1.2442900,,,,1.4975586
SSAYLSVEQACIHR,so,C,132,true,"S-sulfenylation site detection using YAP1C",110,32714340,,,,,,,,
NIQYELAWER,nt,N,170,true,"Arg/N-end rule seed, prt6 vs. Wt",99,29168982,"MASCOT Score",45.4500000,,-0.3922842,0.1704891,NO,0.041159998625517,-2.0784445
NIQYELAWER,nta,N,170,true,"FtsH12 N-terminome: WT / FtsH12 knockdown miRNA",118,33216923,"MaxQuant score",73.8340000,,,,,0.00037754001095891,
AAAEELLEKEIPLK,ac,K,230,true,"Histone deacetylases substrates - hda14 vs WT",98e,29061669,"MaxQuant Score",49.3000000,1.0000000,1.3360000,0.7079458,NO,0.0010000000474975,
KLEPTPGDMIRNPK,mox,M,341,true,"cat2 Methionine oxidation - 1h stress",62a,25693801,"MASCOT Score",81.0000000,,0.2258994,,NO,,
KLEPTPGDMIRNPK,mox,M,341,true,"cat2 Methionine oxidation - 3h stress",62b,25693801,"MASCOT Score",39.0000000,,0.2906394,,NO,,
LVFEKAEEMAQTFR,ac,K,351,true,"Quantitative Acetylproteomics",101,29440448,,,,,,,,
