Peptide,PTM,ModifiedAA,ModifiedPosition,PeptideUniqueToGene,ExperimentDesc,ExpID,PubmedID,ScoreType,IdentScore,LocProb,Log2FChange,PQ-val,QuantSig,PEP,MassErrorPPM
DAVAGAPINVTGSASGSNSATIPSMFPAGSAPPLSPR,ph,S,92,false,"TOR Kinase and ABA Receptor",100,29290610,XCorr,6.3343129,0.9999000,,,,8.0959999815278E-10,
DAVAGAPINVTGSASGSNSATIPSMFPAGSAPPLSPR,ph,S,92,false,"Tissue atlas Arabidopsis - ProteomicsDB",114,32188942,"MaxQuant score",52.8340000,0.9827890,,,,1.0791400200105E-6,
SCGSPR,sno,C,96,false,"hot5-4 / wildtype, FAT-switch S-nitrosoproteome",169,37277371,,,,,,,,
QRAPSNLGSTLK,ph,S,108,false,"Tissue atlas Arabidopsis - ProteomicsDB",114,32188942,"MaxQuant score",90.6890000,0.9999520,,,,0.00056708900956437,
APSNLGSTLK,ph,S,112,false,"Tissue atlas Arabidopsis - ProteomicsDB",114,32188942,"MaxQuant score",115.0500000,0.8011280,,,,0.00018705200636759,
CIDLDANGIITR,ox,C,398,false,"SPEAR - 10 mM H2O2 / mock",138a,34619326,,,,0.9366417,0.0495356,YES,,
CIDLDANGIITR,ox,C,398,false,"SPEAR - 50 mM H2O2 / mock",138b,34619326,,,,1.0399858,0.0067214,YES,,
LSMEEDVEDASNGSAEVWDESSLEAPF,ph,S,520,true,"SnRK2 protein kinase substrates",85,23776212,XCorr,2.6878252,0.9490000,,,,1.0106099580298E-5,
