Peptide,PTM,ModifiedAA,ModifiedPosition,PeptideUniqueToGene,ExperimentDesc,ExpID,PubmedID,ScoreType,IdentScore,LocProb,Log2FChange,PQ-val,QuantSig,PEP,MassErrorPPM
SASEWAFNR,ph,S,29,true,"srk2dei ABA signaling phopshoproteomics",83,23572148,"MASCOT Score",26.0000000,,,,,,0.0001000
SASEWAFNR,ph,S,29,true,"atm and atr DNA damage response",88,25561503,"MASCOT Score",49.0000000,1.0000000,,,,,0.4400000
SASEWAFNR,ph,S,29,true,"SnRK1-triggered switch of bZIP63 dimerization",95,26263501,XCorr,3.1400000,,,,,,
SVSSPPNVPVDSE,ph,S,59,true,"SnRK1-triggered switch of bZIP63 dimerization",95,26263501,XCorr,2.7000000,,,,,,
RMLSNRESARRSRRRK,ph,S,153,false,"SnRK1-triggered switch of bZIP63 dimerization",95,26263501,XCorr,4.4500000,,,,,,
VSLPSETSNSPDTTSS,ph,S,254,true,"SnRK1-triggered switch of bZIP63 dimerization",95,26263501,XCorr,2.7800000,,,,,,
MNRTASMRRVESLEHLQK,ph,S,287,true,"SnRK1-triggered switch of bZIP63 dimerization",95,26263501,XCorr,7.0000000,,,,,,
NRTASMRRVESLEHL,ph,S,287,true,"SnRK1-triggered switch of bZIP63 dimerization",95,26263501,XCorr,4.7300000,,,,,,
MNRTASMRRVESLEHLQK,ph,S,293,true,"SnRK1-triggered switch of bZIP63 dimerization",95,26263501,XCorr,7.0000000,,,,,,
NRTASMRRVESLEHL,ph,S,293,true,"SnRK1-triggered switch of bZIP63 dimerization",95,26263501,XCorr,4.7300000,,,,,,
RVESLEHLQKR,ph,S,293,true,"SnRK1-triggered switch of bZIP63 dimerization",95,26263501,XCorr,5.3600000,,,,,,
RVESLEHLQK,ph,S,293,true,"srk2dei ABA signaling phopshoproteomics",83,23572148,"MASCOT Score",39.0000000,,,,,,0.0001000
RVESLEHLQK,ph,S,293,true,"atm and atr DNA damage response",88,25561503,"MASCOT Score",43.0000000,1.0000000,,,,,-0.8500000
RVESLEHLQK,ph,S,293,true,"SnRK1-triggered switch of bZIP63 dimerization",95,26263501,XCorr,3.2600000,,,,,,
RVESLEHLQK,ph,S,293,true,"TOR Kinase and ABA Receptor",100,29290610,XCorr,2.2347949,1.0000000,,,,0.0013980000512674,
RVESLEHLQK,ph,S,293,true,"Phospho cell culture sucrose/TOR",109,30833711,,,1.0000000,,,,,
VESLEHLQKR,ph,S,293,true,"Tissue atlas Arabidopsis - ProteomicsDB",114,32188942,"MaxQuant score",147.6200000,1.0000000,,,,3.0936400889914E-6,
VESLEHLQK,ph,S,293,true,"atm and atr DNA damage response",88,25561503,"MASCOT Score",40.0000000,1.0000000,,,,,-0.2400000
VESLEHLQK,ph,S,293,true,"SnRK1-triggered switch of bZIP63 dimerization",95,26263501,XCorr,2.9300000,,,,,,
RRVESLEHL,ph,S,293,true,"SnRK1-triggered switch of bZIP63 dimerization",95,26263501,XCorr,2.9500000,,,,,,
