Peptide,PTM,ModifiedAA,ModifiedPosition,PeptideUniqueToGene,ExperimentDesc,ExpID,PubmedID,ScoreType,IdentScore,LocProb,Log2FChange,PQ-val,QuantSig,PEP,MassErrorPPM
DTDFSAESPDLEEDGGGGGGGR,ph,S,11,true,"LAXIC - mannitol vs control",84b,23660473,XCorr,5.9900000,1.0000000,2.9390425,,NO,0.00013417100126389,
DTDFSAESPDLEEDGGGGGGGR,ph,S,11,true,"SnRK2 protein kinase substrates",85,23776212,XCorr,4.6450701,1.0000000,,,,2.1757899958175E-5,
DTDFSAESPDLEEDGGGGGGGR,ph,S,11,true,"atm and atr DNA damage response",88,25561503,"MASCOT Score",91.0000000,1.0000000,,,,,-1.7500000
DTDFSAESPDLEEDGGGGGGGR,ph,S,11,true,"Lateral root-induction - NAA vs control",106,23328941,"MASCOT Score",70.0000000,,,,,,
DTDFSAESPDLEEDGGGGGGGR,ph,S,11,true,"Phospho cell culture sucrose/TOR",109,30833711,,,0.9991540,,,,,
DTDFSAESPDLEEDGGGGGGGR,ph,S,11,true,"Col-0 callus - FC Col-0 vs. Col-0 Xray",111a,31410901,,103.7600000,,3.6636327,0.0000000,NO,,0.9794766
DTDFSAESPDLEEDGGGGGGGR,ph,S,11,true,"Col-0 X-ray callus - FC Col-0 vs. Col-0 Xray",111b,31410901,,103.7600000,,3.6636327,0.0000000,NO,,0.9794766
DTDFSAESPDLEEDGGGGGGGR,ph,S,11,true,"atm callus - FC atm vs. atm Xray",111c,31410901,,103.7600000,,-5.1985646,0.0000000,NO,,0.9794766
DTDFSAESPDLEEDGGGGGGGR,ph,S,11,true,"atm-3 X-ray callus - FC atm vs. atm Xray",111d,31410901,,103.7600000,,-5.1985646,0.0000000,NO,,0.9794766
DTDFSAESPDLEEDGGGGGGGR,ph,S,11,true,"Tissue atlas Arabidopsis - ProteomicsDB",114,32188942,"MaxQuant score",262.2500000,0.9999990,,,,0,
DTDFSAESPDLEEDGGGGGGGR,ph,S,14,true,"Phosphorylation nuclei-enriched fractions",28,19245862,,,,,,,,
DTDFSAESPDLEEDGGGGGGGR,ph,S,14,true,"STN8 phosphoproteome",38,21768351,"MASCOT Score",106.5600000,,,,,,-0.7313230
DTDFSAESPDLEEDGGGGGGGR,ph,S,14,true,"Phosphoproteomic analysis of seed maturation",42,22440515,"MASCOT Score",104.0000000,,,,,,-2.4600000
DTDFSAESPDLEEDGGGGGGGR,ph,S,14,true,"Tyrosine phosphorylation in Arabidopsis",59,18463617,"MASCOT Score",86.0000000,,,,,,-1.4974037
DTDFSAESPDLEEDGGGGGGGR,ph,S,14,true,"Chloroplast kinase substrates",60,19376835,"MASCOT Score",34.8400000,,,,,,-4.1482700
DTDFSAESPDLEEDGGGGGGGR,ph,S,14,true,"srk2dei ABA signaling phopshoproteomics",83,23572148,"MASCOT Score",100.0000000,,,,,,-0.0016000
DTDFSAESPDLEEDGGGGGGGR,ph,S,14,true,"LAXIC - ABA stress",84a,23660473,XCorr,7.2800000,1.0000000,,,,5.9200000892374E-15,
DTDFSAESPDLEEDGGGGGGGR,ph,S,14,true,"LAXIC - mannitol vs control",84b,23660473,XCorr,5.9900000,1.0000000,2.9390425,,NO,0.00013417100126389,
DTDFSAESPDLEEDGGGGGGGR,ph,S,14,true,"SnRK2 protein kinase substrates",85,23776212,XCorr,5.4166646,1.0000000,,,,2.6837500627153E-5,
DTDFSAESPDLEEDGGGGGGGR,ph,S,14,true,"atm and atr DNA damage response",88,25561503,"MASCOT Score",101.0000000,1.0000000,,,,,-0.5500000
DTDFSAESPDLEEDGGGGGGGR,ph,S,14,true,"TOR Kinase and ABA Receptor",100,29290610,XCorr,6.9556308,1.0000000,,,,1.4110000060713E-12,
DTDFSAESPDLEEDGGGGGGGR,ph,S,14,true,"Lateral root-induction - NAA vs control",106,23328941,"MASCOT Score",72.0000000,,,,,,
DTDFSAESPDLEEDGGGGGGGR,ph,S,14,true,"Phospho cell culture sucrose/TOR",109,30833711,,,1.0000000,,,,,
DTDFSAESPDLEEDGGGGGGGR,ph,S,14,true,"Col-0 callus - FC Col-0 vs. Col-0 Xray",111a,31410901,,137.7500000,,-0.5223098,0.0000000,NO,,1.2503578
DTDFSAESPDLEEDGGGGGGGR,ph,S,14,true,"Col-0 X-ray callus - FC Col-0 vs. Col-0 Xray",111b,31410901,,137.7500000,,-0.5223098,0.0000000,NO,,1.2503578
DTDFSAESPDLEEDGGGGGGGR,ph,S,14,true,"atm callus - FC atm vs. atm Xray",111c,31410901,,137.7500000,,-0.5219641,0.0000000,NO,,1.2503578
DTDFSAESPDLEEDGGGGGGGR,ph,S,14,true,"atm-3 X-ray callus - FC atm vs. atm Xray",111d,31410901,,137.7500000,,-0.5219641,0.0000000,NO,,1.2503578
DTDFSAESPDLEEDGGGGGGGR,ph,S,14,true,"Tissue atlas Arabidopsis - ProteomicsDB",114,32188942,"MaxQuant score",476.9300000,1.0000000,,,,0,
GGGETESDEDVVIPEPNEAEDDDHDPDPDPEYEDLNSPSMISR,ph,T,33,true,"SnRK2 protein kinase substrates",85,23776212,XCorr,3.7677932,0.9930000,,,,0.0013152499450371,
GGGETESDEDVVIPEPNEAEDDDHDPDPDPEYEDLNSPSMISR,ph,S,35,true,"SnRK2 protein kinase substrates",85,23776212,XCorr,3.7677932,0.9930000,,,,0.0013152499450371,
SSSGTVTVALPAGSAVPVASIPSDSDQKWHR,og,S,90,true,"O-GlcNac Inflorescence Tissue",81,28154133,"MASCOT Score",33.9000000,,,,,,0.7400000
NCVSPMIK,ph,S,337,true,"atm and atr DNA damage response",88,25561503,"MASCOT Score",34.0000000,1.0000000,,,,,-1.5300000
NCVSPMIK,ph,S,337,true,"Tissue atlas Arabidopsis - ProteomicsDB",114,32188942,"MaxQuant score",94.8040000,1.0000000,,,,0.0059930197894573,
