Peptide,PTM,ModifiedAA,ModifiedPosition,PeptideUniqueToGene,ExperimentDesc,ExpID,PubmedID,ScoreType,IdentScore,LocProb,Log2FChange,PQ-val,QuantSig,PEP,MassErrorPPM
SISNLEEEVFELK,ph,S,46,true,"SnRK2 protein kinase substrates",85,23776212,XCorr,2.4300613,0.9720000,,,,0.012530500069261,
SLSFTK,ph,S,396,false,"srk2dei ABA signaling phopshoproteomics",83,23572148,"MASCOT Score",27.0000000,,,,,,0.0004000
SLSFTK,ph,S,396,false,"TOR Kinase and ABA Receptor",100,29290610,XCorr,2.7426026,0.9904000,,,,0.0085089998319745,
AISPLDHLK,ph,S,474,true,"atm and atr DNA damage response",88,25561503,"MASCOT Score",38.0000000,1.0000000,,,,,-1.9200000
AISPLDHLK,ph,S,474,true,"Tissue atlas Arabidopsis - ProteomicsDB",114,32188942,"MaxQuant score",121.6000000,1.0000000,,,,0.00026433699531481,
AQSIRSVAK,ph,S,529,true,"atm and atr DNA damage response",88,25561503,"MASCOT Score",34.0000000,1.0000000,,,,,-0.4100000
AQSIRSVAK,ph,S,532,true,"atm and atr DNA damage response",88,25561503,"MASCOT Score",34.0000000,1.0000000,,,,,-0.4100000
SYTKPLQAAANSGTPPETPKR,ph,T,573,true,"Tissue atlas Arabidopsis - ProteomicsDB",114,32188942,"MaxQuant score",204.7000000,0.9977750,,,,0,
SYTKPLQAAANSGTPPETPKR,ph,T,577,true,"Tissue atlas Arabidopsis - ProteomicsDB",114,32188942,"MaxQuant score",151.1900000,1.0000000,,,,1.0165200487958E-24,
KNMNDTSSPR,ph,T,595,true,"atm and atr DNA damage response",88,25561503,"MASCOT Score",22.0000000,0.9860000,,,,,-1.1800000
