Peptide,PTM,ModifiedAA,ModifiedPosition,PeptideUniqueToGene,ExperimentDesc,ExpID,PubmedID,ScoreType,IdentScore,LocProb,Log2FChange,PQ-val,QuantSig,PEP,MassErrorPPM
SRGNAAAAKGKKKGVSFTID,nta,S,2,true,"Arabidopsis translation initiation landscape - NTA",167a,35069635,,,,,,,,
SRGNAAAAKGKKKGVSF,nta,S,2,true,"Arg/N-end rule pathway Roots",80,25728785,"MASCOT Score",28.4900000,,,,,0.0038230000063777,
SRGNAAAAK,ph,S,2,true,"atm and atr DNA damage response",88,25561503,"MASCOT Score",29.0000000,1.0000000,,,,,-2.2300000
GVSFTIDCSKPVDDK,ph,S,17,false,"Tissue atlas Arabidopsis - ProteomicsDB",114,32188942,"MaxQuant score",156.7200000,0.9984080,,,,6.163639910961E-12,
KGVSFTIDCSKPVDDK,so,C,22,false,"S-sulfenylation site detection using YAP1C",110,32714340,,,,,,,,
IMEIASLEK,mox,M,31,false,"cat2 Methionine oxidation - 1h stress",62a,25693801,"MASCOT Score",39.0000000,,-0.9472345,,NO,,
IMEIASLEK,mox,M,31,false,"cat2 Methionine oxidation - 3h stress",62b,25693801,"MASCOT Score",32.0000000,,2.0885853,,NO,,
IMEIASLEK,ph,S,35,false,"Phospho cell culture sucrose/TOR",109,30833711,,,1.0000000,,,,,
IMEIASLEK,ph,S,35,false,"Tissue atlas Arabidopsis - ProteomicsDB",114,32188942,"MaxQuant score",95.4770000,1.0000000,,,,0.0015614599687979,
ITVTADGQFSKR,ac,K,76,false,"Quantitative Acetylproteomics",101,29440448,,,,,,,,
VIAANKDR,ub,K,103,false,"Arabidopsis ubiquitination COFRADIC",40,26744219,"MaxQuant Score",102.5100000,1.0000000,,,,0.014000000432134,0.3580000
