Peptide,PTM,ModifiedAA,ModifiedPosition,PeptideUniqueToGene,ExperimentDesc,ExpID,PubmedID,ScoreType,IdentScore,LocProb,Log2FChange,PQ-val,QuantSig,PEP,MassErrorPPM
YAAGAVDCPGSPK,ox,C,11,true,"OxiTRAQ Arabidopsis - 5 mM H2O2 versus control",47,24376095,,,,0.3567923,0.0214386,NO,,
YAAGAVDCPGSPK,sno,C,11,true,"hot5-4 / wildtype, FAT-switch S-nitrosoproteome",169,37277371,,,,0.8775398,0.0001753,YES,,
YAAGAVDCPGSPK,ph,S,14,true,"STN8 phosphoproteome",38,21768351,"MASCOT Score",93.6000000,,,,,,
YAAGAVDCPGSPK,ph,S,14,true,"Chloroplast kinase substrates",60,19376835,"MASCOT Score",78.8600000,,,,,,0.5355530
YAAGAVDCPGSPK,ph,S,14,true,"Conserved plant phosphoproteome - Arabidopsis",61a,20466843,"MASCOT Score",50.0000000,1.0000000,,,,,
YAAGAVDCPGSPK,ph,S,14,true,"atm and atr DNA damage response",88,25561503,"MASCOT Score",88.0000000,1.0000000,,,,,-1.0200000
YAAGAVDCPGSPK,ph,S,14,true,"Protein sumoylation and phosphorylation cross-talk",97,28419593,,,,,,,,
YAAGAVDCPGSPK,ph,S,14,true,"TOR Kinase and ABA Receptor",100,29290610,XCorr,4.9671645,1.0000000,,,,8.0589998674441E-8,
YAAGAVDCPGSPK,ph,S,14,true,"Lateral root-induction - NAA vs control",106,23328941,"MASCOT Score",50.0000000,,,,,,
YAAGAVDCPGSPK,ph,S,14,true,"Col-0 callus - FC Col-0 vs. Col-0 Xray",111a,31410901,,56.7200000,,-0.6025650,0.0000000,NO,,0.4042056
YAAGAVDCPGSPK,ph,S,14,true,"Col-0 X-ray callus - FC Col-0 vs. Col-0 Xray",111b,31410901,,56.7200000,,-0.6025650,0.0000000,NO,,0.4042056
YAAGAVDCPGSPK,ph,S,14,true,"atm callus - FC atm vs. atm Xray",111c,31410901,,56.7200000,,-0.3322277,0.0000000,NO,,0.4042056
YAAGAVDCPGSPK,ph,S,14,true,"atm-3 X-ray callus - FC atm vs. atm Xray",111d,31410901,,56.7200000,,-0.3322277,0.0000000,NO,,0.4042056
YAAGAVDCPGSPK,ph,S,14,true,"Tissue atlas Arabidopsis - ProteomicsDB",114,32188942,"MaxQuant score",208.7900000,1.0000000,,,,4.6890095070406E-39,
DIVAEELKR,ac,K,86,true,"Quantitative Acetylproteomics",101,29440448,,,,,,,,
DIVAEELKR,ub,K,86,true,"Arabidopsis ubiquitination COFRADIC",40,26744219,"MaxQuant Score",70.0560000,1.0000000,,,,0.010999999940395,0.3550000
IPIIVAGCK,so,C,128,true,"Arabidopsis S-sulfenylation chemoproteomics",108,31578252,"pFind PSM Score",0.0019251,,1.0082300,,,,0.1121323
IFILCDHDR,so,C,210,true,"Arabidopsis S-sulfenylation chemoproteomics",108,31578252,"pFind PSM Score",0.2860340,,1.2345700,,,,-1.7616428
DGALSEAELNDFQVK,ph,S,219,true,"Tissue atlas Arabidopsis - ProteomicsDB",114,32188942,"MaxQuant score",145.8600000,1.0000000,,,,1.6644300160351E-8,
DDLDSSPISIQESTR,ph,S,553,true,"Large-scale phosphorylation discovery",44,23111157,XCorr,4.1620000,,,,,,
DDLDSSPISIQESTR,ph,S,553,true,"Tyrosine phosphorylation in Arabidopsis",59,18463617,"MASCOT Score",55.0000000,,,,,,-1.5501757
DDLDSSPISIQESTR,ph,S,553,true,"Tissue atlas Arabidopsis - ProteomicsDB",114,32188942,"MaxQuant score",290.3800000,0.9999840,,,,0,
SLMAVSIGAAAVVVGLAAYRVYATRK,ph,S,619,true,"Large-scale phosphorylation discovery",44,23111157,XCorr,3.2800000,,,,,,
