Peptide,PTM,ModifiedAA,ModifiedPosition,PeptideUniqueToGene,ExperimentDesc,ExpID,PubmedID,ScoreType,IdentScore,LocProb,Log2FChange,PQ-val,QuantSig,PEP,MassErrorPPM
HCTGAVDGSVTPAGGAR,ph,S,76,true,"Large-scale phosphorylation discovery",44,23111157,XCorr,4.8320000,,,,,,
SNSVFVLPR,ph,S,247,true,"atm and atr DNA damage response",88,25561503,"MASCOT Score",40.0000000,1.0000000,,,,,-1.5100000
SNSVFVLPR,ph,S,247,true,"TOR Kinase and ABA Receptor",100,29290610,XCorr,3.5014656,0.9943000,,,,0.0003607000107877,
SNSVFVLPR,ph,S,247,true,"Tissue atlas Arabidopsis - ProteomicsDB",114,32188942,"MaxQuant score",161.1900000,0.9999000,,,,8.832599996822E-5,
KTPSFLWR,ph,T,278,false,"Ethylene-regulated phosphorylation ein2 mutant",30,19253305,"MASCOT Score",55.5556000,,,,,,-3.3983417
KTPSFLWR,ph,S,280,false,"Large-scale phosphorylation discovery",44,23111157,XCorr,2.5220000,,,,,,
KTPSFLWR,ph,S,280,false,"atm and atr DNA damage response",88,25561503,"MASCOT Score",31.0000000,1.0000000,,,,,-1.2900000
KTPSFLWR,ph,S,280,false,"Phospho cell culture sucrose/TOR",109,30833711,,,0.9999350,,,,,
KTPSFLWR,ph,S,280,false,"Tissue atlas Arabidopsis - ProteomicsDB",114,32188942,"MaxQuant score",173.3700000,0.9999960,,,,0.00036728501436301,
TPSFLWR,ph,S,280,false,"Plasmembrane Ph Immune Responses",25,17651370,,,,,,,,
TPSFLWR,ph,S,280,false,"srk2dei ABA signaling phopshoproteomics",83,23572148,"MASCOT Score",37.0000000,,,,,,-0.0007000
TPSFLWR,ph,S,280,false,"Lateral root-induction - NAA vs control",106,23328941,"MASCOT Score",31.0000000,,,,,,
GNSVTSPSGDSVR,ph,S,306,true,"Tissue atlas Arabidopsis - ProteomicsDB",114,32188942,"MaxQuant score",98.9430000,0.9685440,,,,0.00022925199300516,
NTTPVPSPR,ph,S,335,true,"Tissue atlas Arabidopsis - ProteomicsDB",114,32188942,"MaxQuant score",69.7210000,0.9980070,,,,0.010168699547648,
