Peptide,PTM,ModifiedAA,ModifiedPosition,PeptideUniqueToGene,ExperimentDesc,ExpID,PubmedID,ScoreType,IdentScore,LocProb,Log2FChange,PQ-val,QuantSig,PEP,MassErrorPPM
SIHIPLLDQDSFIEPSGNHNVPRPDSIR,ph,S,471,true,"Tissue atlas Arabidopsis - ProteomicsDB",114,32188942,"MaxQuant score",222.5200000,1.0000000,,,,0,
SIHIPLLDQDSFIEPSGNHNVPRPDSIR,ph,S,476,true,"Tissue atlas Arabidopsis - ProteomicsDB",114,32188942,"MaxQuant score",237.5200000,0.9965430,,,,0,
SIHIPLLDQDSFIEPSGNHNVPRPDSIR,ph,S,486,true,"TOR Kinase and ABA Receptor",100,29290610,XCorr,4.5721679,0.9926000,,,,3.7999998312443E-5,
SIHIPLLDQDSFIEPSGNHNVPRPDSIR,ph,S,486,true,"Tissue atlas Arabidopsis - ProteomicsDB",114,32188942,"MaxQuant score",229.2200000,0.9930060,,,,0,
GFVPFVPGSPTERNPPDLSKA,ph,S,526,true,"Arabidopsis root NAA phosphoproteome",18a,27643528,"MaxQuant Score",81.5260000,0.8950000,,,,1.0029999941708E-7,-0.7960000
GFVPFVPGSPTERNPPDLSKA,ph,S,526,true,"Phosphoproteome ethylene-regulated time response",46,24043427,"MASCOT Score",39.3300000,,,,,,-5.7639000
GFVPFVPGSPTERNPPDLSKA,ph,S,526,true,"Chloroplast kinase substrates",60,19376835,"MASCOT Score",36.9700000,,,,,,-0.5627050
GFVPFVPGSPTERNPPDLSKA,ph,S,526,true,"SIRK1 phosphorylation",86a,23820729,"MaxQuant Score",108.2200000,0.8730000,,,,0.27599999308586,7.3350000
GFVPFVPGSPTERNPPDLSKA,ph,S,526,true,"SIRK1 exp - sirk1 mutant vs WT",86b,23820729,,,,-0.7309986,,NO,,
GFVPFVPGSPTERNPPDLSKA,ph,S,526,true,"SIRK1 exp - 35S:SIRK1 vs WT",86c,23820729,,,,-2.1094705,,NO,,
GFVPFVPGSPTERNPPDLSKA,ph,S,526,true,"Tissue atlas Arabidopsis - ProteomicsDB",114,32188942,"MaxQuant score",176.8700000,0.9973800,,,,6.4528102230762E-29,
GFVPFVPGSPTERNPPDLSK,ph,S,526,true,"Brassinosteroid-Regulated Phosphorylation Dynamics",94,26187819,"MaxQuant Score",112.2400000,0.9970000,,,,3.3740001526894E-5,1.5010000
GFVPFVPGSPTERNPPDLSK,ph,S,526,true,"TOR Kinase and ABA Receptor",100,29290610,XCorr,4.4926944,0.9295000,,,,0.0021919999271631,
GFVPFVPGSPTER,ph,S,526,false,"Mitochondrial phosphoproteome",32,19688752,"MASCOT Score",22.3100000,,,,,,7.7076900
GFVPFVPGSPTER,ph,S,526,false,"Phytohormone-responsive phosphoproteins",34,20374526,"MASCOT Score",45.0000000,,,,,,-6.9793000
GFVPFVPGSPTER,ph,S,526,false,"Large-scale phosphorylation discovery",44,23111157,XCorr,3.0440000,,,,,,
GFVPFVPGSPTER,ph,S,526,false,"Phosphoproteome ethylene-regulated time response",46,24043427,"MASCOT Score",40.6700000,,,,,,14.6712000
GFVPFVPGSPTER,ph,S,526,false,"Tyrosine phosphorylation in Arabidopsis",59,18463617,"MASCOT Score",58.0000000,,,,,,-1.0894185
GFVPFVPGSPTER,ph,S,526,false,"Phosphorylation in N starvation",63,22060019,"MASCOT Score",20.0000000,,,,,,-9.8079000
GFVPFVPGSPTER,ph,S,526,false,"srk2dei ABA signaling phopshoproteomics",83,23572148,"MASCOT Score",53.0000000,,,,,,0.0013000
GFVPFVPGSPTER,ph,S,526,false,"LAXIC - ABA stress",84a,23660473,XCorr,2.8800000,0.9990000,,,,0.011354999616742,
GFVPFVPGSPTER,ph,S,526,false,"LAXIC - mannitol vs control",84b,23660473,XCorr,2.1900000,0.9900000,,,,4.7599998652004E-5,
GFVPFVPGSPTER,ph,S,526,false,"SnRK2 protein kinase substrates",85,23776212,XCorr,2.0397573,0.9530000,,,,0.0074195098131895,
GFVPFVPGSPTER,ph,S,526,false,"SIRK1 phosphorylation",86a,23820729,"MaxQuant Score",174.5000000,0.9970000,,,,0.0001475000026403,7.3220000
GFVPFVPGSPTER,ph,S,526,false,"SIRK1 exp - sirk1 mutant vs WT",86b,23820729,,,,-0.8398510,,NO,,
GFVPFVPGSPTER,ph,S,526,false,"SIRK1 exp - 35S:SIRK1 vs WT",86c,23820729,,,,0.2087082,,NO,,
GFVPFVPGSPTER,ph,S,526,false,"atm and atr DNA damage response",88,25561503,"MASCOT Score",50.0000000,0.9510000,,,,,-0.2300000
GFVPFVPGSPTER,ph,S,526,false,"TOR Kinase and ABA Receptor",100,29290610,XCorr,2.6488941,0.9550000,,,,0.00033869998878799,
GFVPFVPGSPTER,ph,S,526,false,"Lateral root-induction - NAA vs control",106,23328941,"MASCOT Score",25.0000000,,,,,,
GFVPFVPGSPTER,ph,S,526,false,"Phosphorylation tonoplast membrane fraction",107,18686298,"MASCOT Score",42.0000000,,,,,,
GFVPFVPGSPTER,ph,S,526,false,"Phospho cell culture sucrose/TOR",109,30833711,,,0.8864010,,,,,
GFVPFVPGSPTER,ph,S,526,false,"Col-0 callus - FC Col-0 vs. Col-0 Xray",111a,31410901,,40.6100000,,0.0771902,0.0000000,NO,,-0.0731418
GFVPFVPGSPTER,ph,S,526,false,"Col-0 X-ray callus - FC Col-0 vs. Col-0 Xray",111b,31410901,,40.6100000,,0.0771902,0.0000000,NO,,-0.0731418
GFVPFVPGSPTER,ph,S,526,false,"atm callus - FC atm vs. atm Xray",111c,31410901,,40.6100000,,0.6146820,0.0000000,NO,,-0.0731418
GFVPFVPGSPTER,ph,S,526,false,"atm-3 X-ray callus - FC atm vs. atm Xray",111d,31410901,,40.6100000,,0.6146820,0.0000000,NO,,-0.0731418
GFVPFVPGSPTER,ph,S,526,false,"Tissue atlas Arabidopsis - ProteomicsDB",114,32188942,"MaxQuant score",176.8700000,0.9239640,,,,5.5721797737328E-16,
GFVPFVPGSPTER,ph,S,526,false,"Touch-induced phosphorylation: 40s touch vs untouc",136,30291188,"MASCOT score",61.8300000,,-0.0331897,0.7634963,NO,,6.0048873
