Peptide,PTM,ModifiedAA,ModifiedPosition,PeptideUniqueToGene,ExperimentDesc,ExpID,PubmedID,ScoreType,IdentScore,LocProb,Log2FChange,PQ-val,QuantSig,PEP,MassErrorPPM
YLSGFTKVDDNR,ac,K,62,false,"Quantitative Acetylproteomics",101,29440448,,,,,,,,
QKYLEALDRQEK,ub,K,80,true,"Protein ubiquitination during photomorphogenesis",3,28461270,,,,,,,,
ENEQLSKYGDTK,ac,K,132,false,"Quantitative Acetylproteomics",101,29440448,,,,,,,,
ENEQLSKYGDTK,ub,K,132,false,"upl3 mutant / wildtype",168,35926874,"MaxQuant score",199.4000000,1.0000000,0.5360529,0.5578000,NO,4.3416898827367E-18,-0.4353500
RPRTPPATPGIVDYQNPDHELMK,ph,T,288,true,"Arabidopsis root NAA phosphoproteome",18a,27643528,"MaxQuant Score",58.0930000,0.9290000,,,,1.7809999917517E-5,0.3270000
RPRTPPATPGIVDYQNPDHELMK,ph,T,288,true,"Large-scale phosphorylation discovery",44,23111157,XCorr,5.3350000,,,,,,
RPRTPPATPGIVDYQNPDHELMK,ph,T,288,true,"PAMP-triggered phosphorylation",48,24601666,"MASCOT Score",44.0100000,,,,,,
RPRTPPATPGIVDYQNPDHELMK,ph,T,288,true,"srk2dei ABA signaling phopshoproteomics",83,23572148,"MASCOT Score",40.0000000,,,,,,-0.0003000
RPRTPPATPGIVDYQNPDHELMK,ph,T,288,true,"TOR Kinase and ABA Receptor",100,29290610,XCorr,4.9401693,0.9996000,,,,3.258000119688E-11,
RPRTPPATPGIVDYQNPDHELMK,ph,T,288,true,"Tissue atlas Arabidopsis - ProteomicsDB",114,32188942,"MaxQuant score",329.8500000,1.0000000,,,,0,
TPPATPGIVDYQNPDHELMK,ph,T,288,true,"atm and atr DNA damage response",88,25561503,"MASCOT Score",34.0000000,0.9990000,,,,,0.5900000
TPPATPGIVDYQNPDHELMK,ph,T,288,true,"Lateral root-induction - NAA vs control",106,23328941,"MASCOT Score",36.0000000,,,,,,
TPPATPGIVDYQNPDHELMK,ph,T,288,true,"Phospho cell culture sucrose/TOR",109,30833711,,,0.9999790,,,,,
TPPATPGIVDYQNPDHELMK,ph,T,288,true,"Col-0 callus - FC Col-0 vs. Col-0 Xray",111a,31410901,,37.9400000,,1.0378133,0.0000000,NO,,0.7268432
TPPATPGIVDYQNPDHELMK,ph,T,288,true,"Col-0 X-ray callus - FC Col-0 vs. Col-0 Xray",111b,31410901,,37.9400000,,1.0378133,0.0000000,NO,,0.7268432
TPPATPGIVDYQNPDHELMK,ph,T,288,true,"atm callus - FC atm vs. atm Xray",111c,31410901,,37.9400000,,0.8411710,0.0000000,NO,,0.7268432
TPPATPGIVDYQNPDHELMK,ph,T,288,true,"atm-3 X-ray callus - FC atm vs. atm Xray",111d,31410901,,37.9400000,,0.8411710,0.0000000,NO,,0.7268432
RPRTPPATPGIVDYQNPDHELMK,ph,T,292,true,"TOR Kinase and ABA Receptor",100,29290610,XCorr,3.9884527,0.9999000,,,,3.1600000511389E-5,
RPRTPPATPGIVDYQNPDHELMK,ph,T,292,true,"Tissue atlas Arabidopsis - ProteomicsDB",114,32188942,"MaxQuant score",162.4900000,1.0000000,,,,8.3067501601788E-39,
RLRPAPSVEEVTYPAPR,ph,S,314,true,"TOR Kinase and ABA Receptor",100,29290610,XCorr,3.4447203,1.0000000,,,,0.00010540000221226,
LRPAPSVEEVTYPAPR,ph,S,314,true,"Large-scale phosphorylation discovery",44,23111157,XCorr,3.0890000,,,,,,
LRPAPSVEEVTYPAPR,ph,S,314,true,"atm and atr DNA damage response",88,25561503,"MASCOT Score",48.0000000,1.0000000,,,,,0.8200000
LRPAPSVEEVTYPAPR,ph,S,314,true,"Tissue atlas Arabidopsis - ProteomicsDB",114,32188942,"MaxQuant score",169.0600000,1.0000000,,,,7.1136400476097E-19,
VDYDAPGKWCTR,ph,Y,535,true,"Phosphoproteomic analysis of seed maturation",42,22440515,"MASCOT Score",33.0000000,,,,,,-0.3900000
LFSCGTSK,so,C,557,false,"S-sulfenylation site detection using YAP1C",110,32714340,,,,,,,,
AMETPASETMR,ph,T,671,true,"Tissue atlas Arabidopsis - ProteomicsDB",114,32188942,"MaxQuant score",98.1670000,0.9998780,,,,8.4074403275736E-5,
AMETPASETMR,ph,S,674,true,"Tissue atlas Arabidopsis - ProteomicsDB",114,32188942,"MaxQuant score",92.9900000,0.8973630,,,,5.7279201428173E-5,
AVPGAPVASVNCK,ph,S,693,true,"Tissue atlas Arabidopsis - ProteomicsDB",114,32188942,"MaxQuant score",113.5300000,1.0000000,,,,0.0001053599989973,
ASVNCK,so,C,696,false,"S-sulfenylation site detection using YAP1C",110,32714340,,,,,,,,
VERGSPVRHSQMLNGVDPSK,ph,S,702,true,"Tissue atlas Arabidopsis - ProteomicsDB",114,32188942,"MaxQuant score",88.5710000,1.0000000,,,,8.8158503785962E-6,
VERGSPVR,ph,S,702,true,"SnRK2 protein kinase substrates",85,23776212,XCorr,2.1258323,1.0000000,,,,0.048097901046276,
VERGSPVR,ph,S,702,true,"Col-0 callus - FC Col-0 vs. Col-0 Xray",111a,31410901,,20.5300000,,1.5631153,0.0000000,NO,,-0.1156390
VERGSPVR,ph,S,702,true,"Col-0 X-ray callus - FC Col-0 vs. Col-0 Xray",111b,31410901,,20.5300000,,1.5631153,0.0000000,NO,,-0.1156390
VERGSPVR,ph,S,702,true,"atm callus - FC atm vs. atm Xray",111c,31410901,,20.5300000,,-2.4696292,0.0000000,NO,,-0.1156390
VERGSPVR,ph,S,702,true,"atm-3 X-ray callus - FC atm vs. atm Xray",111d,31410901,,20.5300000,,-2.4696292,0.0000000,NO,,-0.1156390
VERGSPVRHSQMLNGVDPSK,ph,S,707,true,"TOR Kinase and ABA Receptor",100,29290610,XCorr,2.7434447,0.8320000,,,,0.016620000824332,
VERGSPVRHSQMLNGVDPSK,ph,S,707,true,"Tissue atlas Arabidopsis - ProteomicsDB",114,32188942,"MaxQuant score",96.1280000,1.0000000,,,,1.5453999822057E-6,
HSQMLNGVDPSKSR,ph,S,716,true,"Tissue atlas Arabidopsis - ProteomicsDB",114,32188942,"MaxQuant score",89.3530000,0.8879880,,,,6.5840002207551E-5,
HSQMLNGVDPSKSR,ph,S,718,true,"Tissue atlas Arabidopsis - ProteomicsDB",114,32188942,"MaxQuant score",102.4700000,0.9770260,,,,3.0606901418651E-5,
SRIDDSTDKPK,ph,S,723,true,"Tissue atlas Arabidopsis - ProteomicsDB",114,32188942,"MaxQuant score",115.6800000,0.9540850,,,,9.7547299446887E-6,
IDDSTDKPK,ph,S,723,true,"atm and atr DNA damage response",88,25561503,"MASCOT Score",31.0000000,0.9640000,,,,,-1.1600000
