Peptide,PTM,ModifiedAA,ModifiedPosition,PeptideUniqueToGene,ExperimentDesc,ExpID,PubmedID,ScoreType,IdentScore,LocProb,Log2FChange,PQ-val,QuantSig,PEP,MassErrorPPM
NVFPACESMCICCPALR,acy,C,12,true,"Arabidopsis S-acylation atlas - Meristem",163a,35681017,,,,,,,,
NVFPACESMCICCPALR,acy,C,16,true,"Arabidopsis S-acylation atlas - Meristem",163a,35681017,,,,,,,,
NVFPACESMCICCPALR,acy,C,18,true,"Arabidopsis S-acylation atlas - Meristem",163a,35681017,,,,,,,,
NVFPACESMCICCPALR,acy,C,19,true,"Arabidopsis S-acylation atlas - Meristem",163a,35681017,,,,,,,,
GTTICNSPSYMIVRPR,ph,S,251,true,"atm and atr DNA damage response",88,25561503,"MASCOT Score",33.0000000,0.9820000,,,,,-0.3500000
GTTICNSPSYMIVRPR,ph,S,251,true,"Tissue atlas Arabidopsis - ProteomicsDB",114,32188942,"MaxQuant score",261.6400000,1.0000000,,,,0,
GTTICNSPSYMIVRPR,ph,S,253,true,"Tissue atlas Arabidopsis - ProteomicsDB",114,32188942,"MaxQuant score",104.4500000,0.9843720,,,,6.5892902512132E-7,
KSFQATAR,ub,K,397,true,"Ubiquitination Membrane Proteins",120,33585938,,,,,,,,
ASGYLNESR,ph,S,532,true,"Tissue atlas Arabidopsis - ProteomicsDB",114,32188942,"MaxQuant score",69.7210000,0.9985130,,,,0.010168699547648,
ASGYLNESR,ph,S,538,true,"Tissue atlas Arabidopsis - ProteomicsDB",114,32188942,"MaxQuant score",106.2600000,1.0000000,,,,0.00065872300183401,
LNSIIDR,ph,S,594,true,"TOR Kinase and ABA Receptor",100,29290610,XCorr,3.2734301,1.0000000,,,,0.00082810001913458,
LNSIIDR,ph,S,594,true,"Phospho cell culture sucrose/TOR",109,30833711,,,1.0000000,,,,,
LNSIIDR,ph,S,594,true,"Tissue atlas Arabidopsis - ProteomicsDB",114,32188942,"MaxQuant score",158.0800000,1.0000000,,,,0.0050617600791156,
