Peptide,PTM,ModifiedAA,ModifiedPosition,PeptideUniqueToGene,ExperimentDesc,ExpID,PubmedID,ScoreType,IdentScore,LocProb,Log2FChange,PQ-val,QuantSig,PEP,MassErrorPPM
AVATPNSVLSEEAFKSL,nt,A,61,true,"Arabidopsis translation initiation landscape - NT",167b,35069635,,,,,,,,
AVATPNSVLSEE,nt,A,61,true,"N-terminal ChaFRADIC",92,26010716,"MASCOT Score",54.7200000,,,,,0.0043839998543262,
AVATPNSVLSEE,nt,A,61,true,"Arg/N-end rule seed, prt6 vs. Wt",99,29168982,"MASCOT Score",43.8800000,,-0.0257789,0.9131148,NO,0.00024399999529123,-3.8569587
AVATPNSVLSEE,nt,A,61,true,"HUNTER N-terminome: legumain, GluC and trypsin",119,31951383,"MaxQuant score",157.9900000,,,,,,
AVATPNSVLSE,nt,A,61,true,"Arg/N-end rule seed, prt6 vs. Wt",99,29168982,"MASCOT Score",47.0400000,,0.2033429,0.0584457,NO,0.0011800000211224,-2.2900114
AVATPNSVLSE,nt,A,61,true,"HUNTER N-terminome: legumain, GluC and trypsin",119,31951383,"MaxQuant score",87.3080000,,,,,,
SLGLSDHDEYDLDGDNNNVEADDGEELAISK,ph,S,76,true,"Large-scale phosphorylation discovery",44,23111157,XCorr,4.7330000,,,,,,
SLGLSDHDEYDLDGDNNNVEADDGEELAISK,ph,S,76,true,"Tissue atlas Arabidopsis - ProteomicsDB",114,32188942,"MaxQuant score",99.6630000,0.8220460,,,,4.6434098236062E-25,
SLGLSDHDEYDLDGDNNNVEADDGEELAISK,ph,S,80,true,"Phospho cell culture sucrose/TOR",109,30833711,,,0.9115020,,,,,
SLGLSDHDEYDLDGDNNNVEADDGEELAISK,ph,S,80,true,"Tissue atlas Arabidopsis - ProteomicsDB",114,32188942,"MaxQuant score",238.0100000,0.9978990,,,,0,
SLGLSDHDEYDLDGDNNNVEADDGEELAISK,ph,Y,85,true,"Large-scale phosphorylation discovery",44,23111157,XCorr,5.4030000,,,,,,
TLAFGIPIIKR,ac,K,162,true,"Quantitative Acetylproteomics",101,29440448,,,,,,,,
ELAKQVEK,ac,K,194,true,"Histone deacetylases - apicidin vs control",98a,29061669,"MaxQuant Score",108.4000000,1.0000000,-0.0360000,0.8203515,NO,0.0060000000521541,
ELAKQVEK,ac,K,194,true,"Quantitative Acetylproteomics",101,29440448,,,,,,,,
VATDVASR,nt,V,405,true,"Arg/N-end rule seed, prt6 vs. Wt",99,29168982,"MASCOT Score",45.2400000,,0.1954131,0.7428048,NO,0.038539998233318,-0.7930693
QPPSSRSLLSHE,nt,Q,535,true,"HUNTER N-terminome: legumain, GluC and trypsin",119,31951383,"MaxQuant score",90.1500000,,,,,,
SVTGFLSDLYR,nt,S,569,true,"Arabidopsis translation initiation landscape - NT",167b,35069635,,,,,,,,
GGSSSRGSSDDWLIGGR,me1,R,700,true,"Arabidopsis protein methylome",123,31809900,"MaxQuant Score",140.2200000,1.0000000,,,,0,-0.0728960
GSSDDWLIGGR,ph,S,702,true,"atm and atr DNA damage response",88,25561503,"MASCOT Score",47.0000000,0.9960000,,,,,-0.4900000
GSSDDWLIGGR,ph,S,702,true,"Tissue atlas Arabidopsis - ProteomicsDB",114,32188942,"MaxQuant score",114.8600000,0.8578610,,,,2.9819000701536E-5,
GSSDDWLIGGR,ph,S,703,true,"atm and atr DNA damage response",88,25561503,"MASCOT Score",30.0000000,0.9480000,,,,,-0.4900000
SSSSSRAPSR,ph,S,715,true,"Col-0 callus - FC Col-0 vs. Col-0 Xray",111a,31410901,,24.6700000,,-0.0222058,0.0000000,NO,,1.6317073
SSSSSRAPSR,ph,S,715,true,"Col-0 X-ray callus - FC Col-0 vs. Col-0 Xray",111b,31410901,,24.6700000,,-0.0222058,0.0000000,NO,,1.6317073
SSSSSRAPSR,ph,S,715,true,"atm callus - FC atm vs. atm Xray",111c,31410901,,24.6700000,,0.4354220,0.0000000,NO,,1.6317073
SSSSSRAPSR,ph,S,715,true,"atm-3 X-ray callus - FC atm vs. atm Xray",111d,31410901,,24.6700000,,0.4354220,0.0000000,NO,,1.6317073
SSSSSRAPSR,ph,S,716,true,"Chloroplast kinase substrates",60,19376835,"MASCOT Score",30.9800000,,,,,,-0.2570420
SFGGSCFICGK,ph,S,723,true,"STN8 phosphoproteome",38,21768351,"MASCOT Score",86.7300000,,,,,,
