Peptide,PTM,ModifiedAA,ModifiedPosition,PeptideUniqueToGene,ExperimentDesc,ExpID,PubmedID,ScoreType,IdentScore,LocProb,Log2FChange,PQ-val,QuantSig,PEP,MassErrorPPM
GKPEVDLPEAEIGK,ac,K,201,true,"Quantitative Acetylproteomics",101,29440448,,,,,,,,
LMREGK,mox,M,300,false,"cat2 Methionine oxidation - 3h stress",62b,25693801,"MASCOT Score",33.0000000,,0.0675837,,NO,,
EGKAYVDDTPR,nt,E,302,true,"Arabidopsis translation initiation landscape - NT",167b,35069635,,,,,,,,
GKFNMQDPNKAMR,nt,G,356,true,"Arabidopsis translation initiation landscape - NT",167b,35069635,,,,,,,,
CNPMSHHR,so,C,375,true,"S-sulfenylation site detection using YAP1C",110,32714340,,,,,,,,
SHHRIGDKY,nt,S,379,true,"Arabidopsis translation initiation landscape - NT",167b,35069635,,,,,,,,
IIDPVCPR,ox,C,520,true,"OxiTRAQ Arabidopsis - 5 mM H2O2 versus control",47,24376095,,,,-0.1635982,0.2120553,NO,,
IIDPVCPR,sno,C,520,true,"hot5-4 / wildtype, FAT-switch S-nitrosoproteome",169,37277371,,,,0.2176559,0.0540440,NO,,
IIDPVCPR,so,C,520,true,"Arabidopsis S-sulfenylation chemoproteomics",108,31578252,"pFind PSM Score",0.1481250,,0.7352900,,,,0.4683354
IIDPVCPR,so,C,520,true,"S-sulfenylation site detection using YAP1C",110,32714340,,,,,,,,
GNAIVK,myr,G,590,true,"N-Terminal Myristoylated Proteins",102,29453228,,,,,,,,
TKKETLALGDSNMR,nt,T,665,true,"Metacaspase9 substrates - Col-0 / mc9",51a,23964026,"MASCOT Score",69.0000000,,1.2573181,,NO,,-2.1654957
CGDVIQLER,sno,C,682,true,"Site-specific nitrosomeproteomic id - gsnor1-3",90b,25699590,XCorr,2.2000000,,,,,0.23649999499321,-6.6800000
CGDVIQLER,sno,C,682,true,"hot5-4 / wildtype, FAT-switch S-nitrosoproteome",169,37277371,,,,,,,,
CGDVIQLER,so,C,682,true,"S-sulfenylation site detection using YAP1C",110,32714340,,,,,,,,
CDVPFVK,sno,C,696,true,"hot5-4 / wildtype, FAT-switch S-nitrosoproteome",169,37277371,,,,,,,,
GYFRCDVPFVK,so,C,696,true,"Arabidopsis S-sulfenylation chemoproteomics",108,31578252,"pFind PSM Score",0.0665117,,0.9993200,,,,-1.3591215
CDVPFVK,so,C,696,true,"S-sulfenylation site detection using YAP1C",110,32714340,,,,,,,,
