Peptide,PTM,ModifiedAA,ModifiedPosition,PeptideUniqueToGene,ExperimentDesc,ExpID,PubmedID,ScoreType,IdentScore,LocProb,Log2FChange,PQ-val,QuantSig,PEP,MassErrorPPM
GSVDAANGSGKKPTVIF,nt,G,2,true,"Arg/N-end rule seed, prt6 vs. Wt",99,29168982,"MASCOT Score",37.5600000,,,,,0.0017259999876842,-2.7574654
GSVDAANGSGKKPTVIFVLGGPGSGKGTQCAY,nta,G,2,true,"Arg/N-end rule pathway Roots",80,25728785,"MASCOT Score",73.6900000,,,,,4.7109999457007E-8,
GSVDAANGSGKKPTVIF,nta,G,2,true,"Arg/N-end rule pathway Roots",80,25728785,"MASCOT Score",40.7200000,,,,,0.0016009999671951,
GSVDAANGSGKKPTVIF,nta,G,2,true,"Arg/N-end rule seed, prt6 vs. Wt",99,29168982,"MASCOT Score",37.5600000,,-0.2773171,0.1880823,NO,0.0017259999876842,-2.7574654
GSVDAANGSGKKPTVIF,nta,G,2,true,"Arabidopsis translation initiation landscape - NTA",167a,35069635,,,,,,,,
GSVDAANGSGKKPTVIFVLGGPGSGK,ph,S,3,true,"Tissue atlas Arabidopsis - ProteomicsDB",114,32188942,"MaxQuant score",55.7770000,0.9996910,,,,3.4481701732147E-5,
GSVDAANGSGK,ph,S,3,true,"atm and atr DNA damage response",88,25561503,"MASCOT Score",42.0000000,1.0000000,,,,,-0.9100000
GSVDAANGSGKKPTVIFVLGGPGSGK,ph,S,10,true,"Tissue atlas Arabidopsis - ProteomicsDB",114,32188942,"MaxQuant score",208.1600000,1.0000000,,,,0,
IVPSEVTIKLLQK,ub,K,80,true,"upl3 mutant / wildtype",168,35926874,"MaxQuant score",73.8810000,1.0000000,1.0278618,,,0.00014630099758506,1.3831000
AAFEKVTEIEPK,ub,K,111,true,"upl3 mutant / wildtype",168,35926874,"MaxQuant score",131.0600000,1.0000000,1.0342157,0.2690000,NO,4.1710098486192E-8,0.6610700
VTEIEPK,ph,T,113,true,"Tyrosine phosphorylation in Arabidopsis",59,18463617,"MASCOT Score",40.0000000,,,,,,-0.4472225
VTEIEPK,ph,T,113,true,"Conserved plant phosphoproteome - Arabidopsis",61a,20466843,"MASCOT Score",41.0000000,1.0000000,,,,,
VTEIEPK,ph,T,113,true,"srk2dei ABA signaling phopshoproteomics",83,23572148,"MASCOT Score",43.0000000,,,,,,0.0006000
VTEIEPK,ph,T,113,true,"TOR Kinase and ABA Receptor",100,29290610,XCorr,2.1121745,1.0000000,,,,0.022299999371171,
