Peptide,PTM,ModifiedAA,ModifiedPosition,PeptideUniqueToGene,ExperimentDesc,ExpID,PubmedID,ScoreType,IdentScore,LocProb,Log2FChange,PQ-val,QuantSig,PEP,MassErrorPPM
TATSSSTIEEQR,nt,T,53,true,"Arg/N-end rule seed, prt6 vs. Wt",99,29168982,"MASCOT Score",82.7900000,,0.0896496,0.6524683,NO,0.0028039999306202,-0.5217737
TATSSSTIEE,nt,T,53,true,"N-terminal ChaFRADIC",92,26010716,"MASCOT Score",57.2900000,,,,,5.7550001656637E-5,
TATSSSTIEE,nt,T,53,true,"Arg/N-end rule seed, prt6 vs. Wt",99,29168982,"MASCOT Score",61.5700000,,0.2606624,0.2161422,NO,0.0032730000093579,-0.9928873
TATSSSTIEEQR,nta,T,53,true,"FtsH12 N-terminome: WT / FtsH12 knockdown miRNA",118,33216923,"MaxQuant score",203.1100000,,,,,0,
ATSSSTIEEQR,nt,A,54,true,"Arg/N-end rule seed, prt6 vs. Wt",99,29168982,"MASCOT Score",74.6200000,,0.2063106,0.1574745,NO,0.010549999773502,-1.1872008
ATSSSTIE,nt,A,54,true,"Arg/N-end rule seed, prt6 vs. Wt",99,29168982,"MASCOT Score",48.0100000,,0.0229672,0.9183080,NO,0.010479999706149,0.6396965
TSSSTIEEQRKKK,nt,T,55,true,"Arabidopsis translation initiation landscape - NT",167b,35069635,,,,,,,,
TSSSTIEEQR,nt,T,55,true,"Arg/N-end rule pathway Roots",80,25728785,"MASCOT Score",28.8400000,,,,,0.012919999659061,
TSSSTIEEQR,nt,T,55,true,"N-terminal ChaFRADIC",92,26010716,"MASCOT Score",46.4100000,,,,,0.0018899999558926,
TSSSTIEEQR,nt,T,55,true,"Arg/N-end rule seed, prt6 vs. Wt",99,29168982,"MASCOT Score",60.7900000,,0.1158189,0.6632976,NO,0.0046720001846552,-1.4992484
TSSSTIEE,nt,T,55,true,"N-terminal ChaFRADIC",92,26010716,"MASCOT Score",36.5400000,,,,,0.048689998686314,
TSSSTIEE,nt,T,55,true,"Arg/N-end rule seed, prt6 vs. Wt",99,29168982,"MASCOT Score",58.6300000,,0.0948848,0.6640815,NO,0.034650001674891,0.1665297
TSSSTIEEQRKKK,nta,T,55,true,"Arabidopsis translation initiation landscape - NTA",167a,35069635,,,,,,,,
TSSSTIEEQR,nta,T,55,true,"Characterization plant N-terminal acetylation",6,22223895,"MASCOT Score",77.1600000,,,,,,
TSSSTIEEQR,nta,T,55,true,"N-terminal ChaFRADIC",92,26010716,"MASCOT Score",46.4100000,,,,,0.0018899999558926,
TSSSTIEEQR,nta,T,55,true,"FtsH12 N-terminome: WT / FtsH12 knockdown miRNA",118,33216923,"MaxQuant score",54.6370000,,,,,0.0029557000380009,
VPNSGNFSVVCHWDATR,so,C,162,true,"Arabidopsis S-sulfenylation chemoproteomics",108,31578252,"pFind PSM Score",0.0002612,,,,,,0.6670977
VVGSENGAQLQK,ph,S,203,true,"Tissue atlas Arabidopsis - ProteomicsDB",114,32188942,"MaxQuant score",92.2950000,1.0000000,,,,0.00030170500394888,
NWDTSGLEGTALK,ph,S,243,true,"Tissue atlas Arabidopsis - ProteomicsDB",114,32188942,"MaxQuant score",101.7200000,0.9676070,,,,0.00020400299399626,
WINTGQIPCFEDGGHHRPNR,sno,C,303,true,"Site-specific nitrosomeproteomic id - gsnor1-3",90a,25699590,XCorr,2.7183022,,,,,0.00039130001096055,-5.4399026
WINTGQIPCFEDGGHHRPNR,sno,C,303,true,"Site-specific nitrosomeproteomic id - gsnor1-3",90b,25699590,XCorr,3.1300000,,,,,0.006810000166297,-3.2800000
ELEHICSK,sno,C,330,true,"Site-specific nitrosomeproteomic id - gsnor1-3",90b,25699590,XCorr,2.3700000,,,,,0.27140000462532,-6.2200000
ELEHICSK,so,C,330,true,"Arabidopsis S-sulfenylation chemoproteomics",108,31578252,"pFind PSM Score",0.1082570,,1.1111100,,,,-0.8571868
KIHPCLPSFK,sno,C,349,true,"Site-specific nitrosomeproteomic id - gsnor1-3",90b,25699590,XCorr,2.1032734,,,,,0.31450000405312,-6.8167938
ITETPGKYSGDFVEQFK,ac,K,416,true,"Histone deacetylases substrates - hda14 vs WT",98e,29061669,"MaxQuant Score",43.2000000,1.0000000,0.0830000,0.9183326,NO,0.0020000000949949,
GLSALNLFFECKK,ox,C,466,true,"OxiTRAQ SA and flg22 responses - SA vs mock",91a,25720653,"MASCOT Score",49.4600000,,1.1699250,0.0160000,YES,,
GLSALNLFFECKK,ox,C,466,true,"OxiTRAQ SA and flg22 responses - flg22 vs mock",91b,25720653,"MASCOT Score",49.4600000,,1.2570106,0.0370000,YES,,
ELNSGLRNDAPDTAIAMR,ph,S,502,true,"Tissue atlas Arabidopsis - ProteomicsDB",114,32188942,"MaxQuant score",88.7550000,1.0000000,,,,1.0895300306402E-7,
EGEEDGKTIWAMR,ph,T,612,true,"Tissue atlas Arabidopsis - ProteomicsDB",114,32188942,"MaxQuant score",50.6080000,1.0000000,,,,0.0085845096036792,
LEASPSHVNLILSTEGR,ph,S,796,true,"atm and atr DNA damage response",88,25561503,"MASCOT Score",54.0000000,0.9930000,,,,,0.3200000
LEASPSHVNLILSTEGR,ph,S,798,true,"TOR Kinase and ABA Receptor",100,29290610,XCorr,3.8216085,0.9940000,,,,1.9760000213864E-5,
LEASPSHVNLILSTEGR,ph,S,798,true,"Tissue atlas Arabidopsis - ProteomicsDB",114,32188942,"MaxQuant score",226.4400000,0.9999460,,,,0,
LEASPSHVNLILSTEGR,ph,T,806,true,"srk2dei ABA signaling phopshoproteomics",83,23572148,"MASCOT Score",29.0000000,,,,,,0.0000000
LEASPSHVNLILSTEGR,ph,T,806,true,"atm and atr DNA damage response",88,25561503,"MASCOT Score",51.0000000,0.9400000,,,,,-0.3900000
LEASPSHVNLILSTEGR,ph,T,806,true,"Phospho cell culture sucrose/TOR",109,30833711,,,0.9504350,,,,,
LEASPSHVNLILSTEGR,ph,T,806,true,"Tissue atlas Arabidopsis - ProteomicsDB",114,32188942,"MaxQuant score",220.8600000,0.9557580,,,,0,
SRTSKSSATK,ph,T,818,true,"srk2dei ABA signaling phopshoproteomics",83,23572148,"MASCOT Score",25.0000000,,,,,,-0.0008000
SAACGLLASLAEASSK,sno,C,883,true,"Site-specific nitrosomeproteomic id - gsnor1-3",90a,25699590,XCorr,4.5114293,,,,,1.9199999812258E-8,-4.9591576
SAACGLLASLAEASSK,sno,C,883,true,"Site-specific nitrosomeproteomic id - gsnor1-3",90b,25699590,XCorr,4.4800000,,,,,0.0070130000822246,-7.0500000
LETARPEGGELDDICDQIHEVMK,sno,C,953,true,"Site-specific nitrosomeproteomic id - gsnor1-3",90b,25699590,XCorr,2.5500000,,,,,1.4419999843085E-6,-5.9400000
