Peptide,PTM,ModifiedAA,ModifiedPosition,PeptideUniqueToGene,ExperimentDesc,ExpID,PubmedID,ScoreType,IdentScore,LocProb,Log2FChange,PQ-val,QuantSig,PEP,MassErrorPPM
AKSTVSFRDGMLPNGDFE,nt,A,20,true,"HUNTER N-terminome: legumain, GluC and trypsin",119,31951383,"MaxQuant score",145.6100000,,,,,,
AKSTVSFRDGMLPNGDFE,nt,A,20,true,"Arabidopsis translation initiation landscape - NT",167b,35069635,,,,,,,,
LGNEASIKQR,ac,K,97,false,"Quantitative Acetylproteomics",101,29440448,,,,,,,,
LGNEASIKQR,ub,K,97,false,"Arabidopsis ubiquitination COFRADIC",40,26744219,"MaxQuant Score",66.0560000,1.0000000,,,,0.0049999998882413,0.1850000
TCAQDER,ox,C,118,false,"OxiTRAQ Arabidopsis - 5 mM H2O2 versus control",47,24376095,,,,-0.2965024,0.1230976,NO,,
GPLIDGVAMR,nt,G,176,false,"Arg/N-end rule seed, prt6 vs. Wt",99,29168982,"MASCOT Score",43.5800000,,-1.0874758,0.0000444,YES,0.033720001578331,-1.3241917
PLIDGVAMR,nt,P,177,false,"Arg/N-end rule seed, prt6 vs. Wt",99,29168982,"MASCOT Score",31.0600000,,-0.9726514,0.0255718,NO,0.1811999976635,-1.0970764
AIELVAGKESAIAQVVR,nt,A,257,true,"Arabidopsis translation initiation landscape - NT",167b,35069635,,,,,,,,
AIELVAGKESAIAQVVR,hib,K,264,true,"Open search Plant PTM Viewer 2.0 - hib",164e,TBA,,,,,,,,
GTGGFKR,ac,K,321,true,"Quantitative Acetylproteomics",101,29440448,,,,,,,,
SDDFSSLCGPVIDDVK,acy,C,354,false,"Arabidopsis S-acylation atlas - Hypocotyl",163b,35681017,,,,,,,,
SDDFSSLCGPVIDDVK,sno,C,354,false,"hot5-4 / wildtype, FAT-switch S-nitrosoproteome",169,37277371,,,,0.4598352,0.0107941,NO,,
