Peptide,PTM,ModifiedAA,ModifiedPosition,PeptideUniqueToGene,ExperimentDesc,ExpID,PubmedID,ScoreType,IdentScore,LocProb,Log2FChange,PQ-val,QuantSig,PEP,MassErrorPPM
LGQTPDDAVVDAGPAVFISPTGR,ph,S,356,true,"Tissue atlas Arabidopsis - ProteomicsDB",114,32188942,"MaxQuant score",150.0300000,0.7993570,,,,8.90948035284E-34,
QPQSVGTPGR,ph,T,497,true,"Tissue atlas Arabidopsis - ProteomicsDB",114,32188942,"MaxQuant score",110.5500000,0.9993210,,,,7.6944201878038E-13,
RPEPPSPPESK,ph,S,632,true,"Chloroplast kinase substrates",60,19376835,"MASCOT Score",36.0600000,,,,,,0.1725700
RPEPPSPPESK,ph,S,632,true,"atm and atr DNA damage response",88,25561503,"MASCOT Score",41.0000000,1.0000000,,,,,-0.1300000
RPEPPSPPESK,ph,S,632,true,"TOR Kinase and ABA Receptor",100,29290610,XCorr,3.0646250,0.9801000,,,,0.011850000359118,
RPEPPSPPESK,ph,S,632,true,"Lateral root-induction - NAA vs control",106,23328941,"MASCOT Score",32.0000000,,,,,,
RPEPPSPPESK,ph,S,632,true,"Col-0 callus - FC Col-0 vs. Col-0 Xray",111a,31410901,,32.9900000,,0.6935484,0.0000000,NO,,0.2830001
RPEPPSPPESK,ph,S,632,true,"Col-0 X-ray callus - FC Col-0 vs. Col-0 Xray",111b,31410901,,32.9900000,,0.6935484,0.0000000,NO,,0.2830001
RPEPPSPPESK,ph,S,632,true,"atm callus - FC atm vs. atm Xray",111c,31410901,,32.9900000,,0.2591916,0.0000000,NO,,0.2830001
RPEPPSPPESK,ph,S,632,true,"atm-3 X-ray callus - FC atm vs. atm Xray",111d,31410901,,32.9900000,,0.2591916,0.0000000,NO,,0.2830001
RPEPPSPPESK,ph,S,632,true,"Tissue atlas Arabidopsis - ProteomicsDB",114,32188942,"MaxQuant score",209.2100000,1.0000000,,,,6.9809802073274E-25,
