Peptide,PTM,ModifiedAA,ModifiedPosition,PeptideUniqueToGene,ExperimentDesc,ExpID,PubmedID,ScoreType,IdentScore,LocProb,Log2FChange,PQ-val,QuantSig,PEP,MassErrorPPM
ATTSSTTKAKPDNQNLSR,nta,A,2,true,"Arg/N-end rule pathway Roots",80,25728785,"MASCOT Score",40.9300000,,,,,0.00044520001392812,
AKPDNQNLSR,ph,S,18,true,"Tissue atlas Arabidopsis - ProteomicsDB",114,32188942,"MaxQuant score",106.1100000,1.0000000,,,,6.8079003540333E-5,
KNNNSLDDNQK,ph,S,73,true,"Tissue atlas Arabidopsis - ProteomicsDB",114,32188942,"MaxQuant score",166.0500000,1.0000000,,,,1.6481800299561E-11,
SFDRPPSSLTSPSTSASPR,ph,S,85,true,"Tissue atlas Arabidopsis - ProteomicsDB",114,32188942,"MaxQuant score",172.2000000,0.9999960,,,,1.7884900465072E-28,
SFDRPPSSLTSPSTSASPR,ph,T,94,true,"Tissue atlas Arabidopsis - ProteomicsDB",114,32188942,"MaxQuant score",103.9200000,0.8251860,,,,2.645990093697E-7,
SFDRPPSSLTSPSTSASPR,ph,S,95,true,"Tissue atlas Arabidopsis - ProteomicsDB",114,32188942,"MaxQuant score",207.5400000,0.9855450,,,,0,
SFDRPPSSLTSPSTSASPR,ph,S,97,true,"Tissue atlas Arabidopsis - ProteomicsDB",114,32188942,"MaxQuant score",103.9200000,0.7708290,,,,2.645990093697E-7,
SFDRPPSSLTSPSTSASPR,ph,S,101,true,"Pollen phosphoproteome Arabidopsis",43,22631563,"MASCOT Score",44.9600000,,,,,,-3.4582600
SFDRPPSSLTSPSTSASPR,ph,S,101,true,"Tissue atlas Arabidopsis - ProteomicsDB",114,32188942,"MaxQuant score",207.5400000,0.9991310,,,,0,
SLNVSPSR,ph,S,107,true,"Tissue atlas Arabidopsis - ProteomicsDB",114,32188942,"MaxQuant score",94.1220000,1.0000000,,,,0.0049554398283362,
SLNVSPSR,ph,S,111,true,"Tissue atlas Arabidopsis - ProteomicsDB",114,32188942,"MaxQuant score",151.2200000,0.9999950,,,,0.0017222199821845,
SLNVSPSR,ph,S,113,true,"Tissue atlas Arabidopsis - ProteomicsDB",114,32188942,"MaxQuant score",164.1000000,1.0000000,,,,0.0009050450171344,
SPPVAPK,ph,S,150,true,"Tissue atlas Arabidopsis - ProteomicsDB",114,32188942,"MaxQuant score",213.9900000,1.0000000,,,,0,
KASDKEIALDSASMSSAQEDHQEEILK,ph,S,183,true,"Tissue atlas Arabidopsis - ProteomicsDB",114,32188942,"MaxQuant score",135.5700000,0.9999960,,,,9.31863478776E-43,
EIALDSASMSSAQEDHQEEILK,ph,S,193,true,"Tissue atlas Arabidopsis - ProteomicsDB",114,32188942,"MaxQuant score",263.6100000,0.9866680,,,,0,
EIALDSASMSSAQEDHQEEILK,ph,S,195,true,"Tissue atlas Arabidopsis - ProteomicsDB",114,32188942,"MaxQuant score",296.4500000,0.8555830,,,,0,
EIALDSASMSSAQEDHQEEILK,ph,S,196,true,"Tissue atlas Arabidopsis - ProteomicsDB",114,32188942,"MaxQuant score",188.6900000,0.8009820,,,,0,
VESDHLQVSDHDIEEPK,ph,S,210,true,"Tissue atlas Arabidopsis - ProteomicsDB",114,32188942,"MaxQuant score",256.1100000,1.0000000,,,,0,
VESDHLQVSDHDIEEPKYEK,ph,S,216,true,"Tissue atlas Arabidopsis - ProteomicsDB",114,32188942,"MaxQuant score",194.7500000,1.0000000,,,,0,
VESDHLQVSDHDIEEPK,ph,S,216,true,"Arabidopsis root NAA phosphoproteome",18a,27643528,"MaxQuant Score",41.1150000,0.9700000,,,,0.0010000000474975,-0.0120000
VESDHLQVSDHDIEEPK,ph,S,216,true,"TOR Kinase and ABA Receptor",100,29290610,XCorr,2.6176243,0.8191000,,,,0.031010000035167,
VVQANESVEEK,ph,S,242,true,"Tissue atlas Arabidopsis - ProteomicsDB",114,32188942,"MaxQuant score",161.2500000,1.0000000,,,,9.8664097725187E-11,
AESSGPTPVASPVGK,ph,S,249,true,"Tissue atlas Arabidopsis - ProteomicsDB",114,32188942,"MaxQuant score",270.9400000,0.9999640,,,,0,
AESSGPTPVASPVGK,ph,S,250,true,"Tissue atlas Arabidopsis - ProteomicsDB",114,32188942,"MaxQuant score",156.8600000,0.9948440,,,,2.6501199238554E-12,
AESSGPTPVASPVGK,ph,T,253,true,"Tissue atlas Arabidopsis - ProteomicsDB",114,32188942,"MaxQuant score",264.4400000,0.9999990,,,,0,
AESSGPTPVASPVGK,ph,S,257,true,"Pollen phosphoproteome Arabidopsis",43,22631563,"MASCOT Score",83.6400000,,,,,,-1.5541800
AESSGPTPVASPVGK,ph,S,257,true,"Tissue atlas Arabidopsis - ProteomicsDB",114,32188942,"MaxQuant score",273.3900000,1.0000000,,,,0,
AESSGPTPVASPVGKDCNAVVAELEEK,ub,K,261,true,"Arabidopsis ubiquitination by TUBEs",2,23667124,,,,,,,,
TEEMKEQDNNQANKSEEEEDVK,ph,S,299,true,"Tissue atlas Arabidopsis - ProteomicsDB",114,32188942,"MaxQuant score",173.6500000,1.0000000,,,,1.7042300095871E-28,
KIDENETPEKVDTESK,ph,T,314,true,"Tissue atlas Arabidopsis - ProteomicsDB",114,32188942,"MaxQuant score",248.7000000,1.0000000,,,,0,
IDENETPEKVDTESK,ph,T,314,true,"Pollen phosphoproteome Arabidopsis",43,22631563,"MASCOT Score",40.1300000,,,,,,-1.6168800
EVESVEETTQEK,ph,S,327,true,"Tissue atlas Arabidopsis - ProteomicsDB",114,32188942,"MaxQuant score",171.2000000,1.0000000,,,,1.5249300060695E-25,
VEEEEKEK,ac,K,352,true,"Quantitative Acetylproteomics",101,29440448,,,,,,,,
VEEEEKEK,ac,K,371,true,"Quantitative Acetylproteomics",101,29440448,,,,,,,,
KESPSAYNDVIASK,ph,S,403,true,"Tissue atlas Arabidopsis - ProteomicsDB",114,32188942,"MaxQuant score",282.5700000,0.9999990,,,,0,
