Peptide,PTM,ModifiedAA,ModifiedPosition,PeptideUniqueToGene,ExperimentDesc,ExpID,PubmedID,ScoreType,IdentScore,LocProb,Log2FChange,PQ-val,QuantSig,PEP,MassErrorPPM
RSPPPPPPTQR,ph,S,78,true,"Large-scale phosphorylation discovery",44,23111157,XCorr,3.3200000,,,,,,
RSPPPPPPTQR,ph,S,78,true,"Chloroplast kinase substrates",60,19376835,"MASCOT Score",43.8600000,,,,,,-0.3054840
RSPPPPPPTQR,ph,S,78,true,"atm and atr DNA damage response",88,25561503,"MASCOT Score",35.0000000,0.9910000,,,,,-0.3700000
RSPPPPPPTQR,ph,S,78,true,"TOR Kinase and ABA Receptor",100,29290610,XCorr,3.0929816,1.0000000,,,,0.0031419999431819,
SPPPPPPTQR,ph,S,78,true,"Chloroplast kinase substrates",60,19376835,"MASCOT Score",43.2700000,,,,,,0.0247869
SPPPPPPTQR,ph,S,78,true,"atm and atr DNA damage response",88,25561503,"MASCOT Score",36.0000000,1.0000000,,,,,0.0000000
SPPPPPPTQR,ph,S,78,true,"Protein sumoylation and phosphorylation cross-talk",97,28419593,,,,,,,,
SPPPPPPTQR,ph,S,78,true,"Lateral root-induction - NAA vs control",106,23328941,"MASCOT Score",28.0000000,,,,,,
SPPPPPPTQR,ph,S,78,true,"Phospho cell culture sucrose/TOR",109,30833711,,,1.0000000,,,,,
SPPPPPPTQR,ph,S,78,true,"Tissue atlas Arabidopsis - ProteomicsDB",114,32188942,"MaxQuant score",113.0300000,1.0000000,,,,3.3146199712064E-5,
IKILPGTYNR,ub,K,215,true,"Arabidopsis ubiquitination COFRADIC",40,26744219,"MaxQuant Score",77.6620000,1.0000000,,,,0.0010000000474975,0.0760000
RVEERNSLSYPGLPAR,ph,S,230,true,"Tissue atlas Arabidopsis - ProteomicsDB",114,32188942,"MaxQuant score",80.8440000,0.9766910,,,,0.00027819600654766,
NSLSYPGLPAR,ph,S,230,true,"atm and atr DNA damage response",88,25561503,"MASCOT Score",41.0000000,1.0000000,,,,,1.0000000
NSLSYPGLPAR,ph,S,232,true,"Tissue atlas Arabidopsis - ProteomicsDB",114,32188942,"MaxQuant score",117.2100000,0.9986390,,,,2.7752299502026E-5,
