Peptide,PTM,ModifiedAA,ModifiedPosition,PeptideUniqueToGene,ExperimentDesc,ExpID,PubmedID,ScoreType,IdentScore,LocProb,Log2FChange,PQ-val,QuantSig,PEP,MassErrorPPM
LPVTSSPK,ph,T,195,true,"Lateral root-induction - NAA vs control",106,23328941,"MASCOT Score",25.0000000,,,,,,
LPVTSSPK,ph,S,196,true,"Tissue atlas Arabidopsis - ProteomicsDB",114,32188942,"MaxQuant score",156.8300000,0.9191440,,,,0.0013994900509715,
DRPDNLVLRLPVTSSPK,ph,S,197,true,"Phosphorylation in N starvation",63,22060019,"MASCOT Score",99.0000000,,,,,,-0.3724170
LPVTSSPKK,ph,S,197,true,"Phospho cell culture sucrose/TOR",109,30833711,,,0.9333880,,,,,
LPVTSSPK,ph,S,197,true,"atm and atr DNA damage response",88,25561503,"MASCOT Score",30.0000000,1.0000000,,,,,-2.0300000
LPVTSSPK,ph,S,197,true,"Lateral root-induction - NAA vs control",106,23328941,"MASCOT Score",41.0000000,,,,,,
LPVTSSPK,ph,S,197,true,"Tissue atlas Arabidopsis - ProteomicsDB",114,32188942,"MaxQuant score",182.1600000,0.9535600,,,,1.1033100236091E-5,
GYCDSNATNK,ox,C,332,true,"OxiTRAQ Arabidopsis - 5 mM H2O2 versus control",47,24376095,,,,2.4666820,0.0010225,YES,,
