Peptide,PTM,ModifiedAA,ModifiedPosition,PeptideUniqueToGene,ExperimentDesc,ExpID,PubmedID,ScoreType,IdentScore,LocProb,Log2FChange,PQ-val,QuantSig,PEP,MassErrorPPM
SNQPVHVTLSELK,ph,S,13,true,"Tissue atlas Arabidopsis - ProteomicsDB",114,32188942,"MaxQuant score",170.4700000,0.9999320,,,,4.6063900544164E-15,
SLSDSEEKSNLEK,ph,S,156,true,"Tissue atlas Arabidopsis - ProteomicsDB",114,32188942,"MaxQuant score",54.2610000,0.9898230,,,,0.012854499742389,
SLSDSEEKSNLEK,ph,S,158,true,"Tissue atlas Arabidopsis - ProteomicsDB",114,32188942,"MaxQuant score",270.9700000,0.9999980,,,,0,
SLSDSEEK,ph,S,158,true,"atm and atr DNA damage response",88,25561503,"MASCOT Score",40.0000000,0.9510000,,,,,-0.1700000
SLSDSEEKSNLEK,ph,S,160,true,"Tissue atlas Arabidopsis - ProteomicsDB",114,32188942,"MaxQuant score",131.4000000,0.9999560,,,,4.7714900574647E-5,
SLSDSEEKSNLEK,ph,S,164,true,"Tissue atlas Arabidopsis - ProteomicsDB",114,32188942,"MaxQuant score",136.1000000,1.0000000,,,,8.9565101006883E-6,
HVNSSLDLKPDIPVVEPDEPSDIEEMESPVK,ph,S,254,true,"TOR Kinase and ABA Receptor",100,29290610,XCorr,5.9280701,0.8751000,,,,1.357000058988E-7,
HVNSSLDLKPDIPVVEPDEPSDIEEMESPVK,ph,S,254,true,"Tissue atlas Arabidopsis - ProteomicsDB",114,32188942,"MaxQuant score",151.7300000,0.9999830,,,,0,
HVNSSLDLKPDIPVVEPDEPSDIEEMESPVK,ph,S,261,true,"TOR Kinase and ABA Receptor",100,29290610,XCorr,4.4204926,0.9992000,,,,9.3460002972279E-5,
HVNSSLDLKPDIPVVEPDEPSDIEEMESPVK,ph,S,261,true,"Tissue atlas Arabidopsis - ProteomicsDB",114,32188942,"MaxQuant score",125.9300000,0.7968910,,,,1.4012984643248E-45,
