Peptide,PTM,ModifiedAA,ModifiedPosition,PeptideUniqueToGene,ExperimentDesc,ExpID,PubmedID,ScoreType,IdentScore,LocProb,Log2FChange,PQ-val,QuantSig,PEP,MassErrorPPM
VSQKPEVDAWTGSDSSKSSADNLAGWDDSDNDDKKSSR,nta,V,48,true,"HUNTER N-terminome: legumain, GluC and trypsin",119,31951383,"MaxQuant score",58.2570000,,,,,,
VSQKPEVDAWTGSD,nta,V,48,true,"HUNTER N-terminome: legumain, GluC and trypsin",119,31951383,"MaxQuant score",,,,,,,
QKPEVDAWTGSDSSKSSADNLAGWDDSDNDDKKSSR,nt,Q,50,true,"HUNTER N-terminome: legumain, GluC and trypsin",119,31951383,"MaxQuant score",78.6940000,,,,,,
QKPEVDAWTGSDSSKSSADN,nt,Q,50,true,"HUNTER N-terminome: legumain, GluC and trypsin",119,31951383,"MaxQuant score",84.1660000,,,,,,
QKPEVDAWTGSD,nt,Q,50,true,"HUNTER N-terminome: legumain, GluC and trypsin",119,31951383,"MaxQuant score",74.1620000,,,,,,
SSADNLAGWDDSDNDDKK,ph,S,76,true,"TOR Kinase and ABA Receptor",100,29290610,XCorr,5.5168829,1.0000000,,,,2.9729999795336E-8,
SSADNLAGWDDSDNDDKK,ph,S,76,true,"Tissue atlas Arabidopsis - ProteomicsDB",114,32188942,"MaxQuant score",408.2400000,1.0000000,,,,0,
SSADNLAGWDDSDNDDK,ph,S,76,true,"TOR Kinase and ABA Receptor",100,29290610,XCorr,5.6357417,1.0000000,,,,1.5669999742229E-9,
KQEMHSLTSQQESMIQSSDEISSDEIK,ph,S,138,true,"Tissue atlas Arabidopsis - ProteomicsDB",114,32188942,"MaxQuant score",132.1700000,0.9565690,,,,1.0229478789571E-42,
VANSEESNLKDEDK,ph,S,152,true,"Tissue atlas Arabidopsis - ProteomicsDB",114,32188942,"MaxQuant score",51.7600000,0.9713900,,,,0.0029516899958253,
VANSEESNLKDEDKSIESNDVAQK,ph,S,163,true,"Tissue atlas Arabidopsis - ProteomicsDB",114,32188942,"MaxQuant score",57.6700000,0.9435230,,,,5.8042700402439E-5,
SIESNDVAQKSDEGSGEDKLLGK,ph,S,173,true,"Tissue atlas Arabidopsis - ProteomicsDB",114,32188942,"MaxQuant score",141.3800000,0.9986140,,,,2.5682900231003E-30,
SDEGSGEDKLLGK,ph,S,177,true,"Tissue atlas Arabidopsis - ProteomicsDB",114,32188942,"MaxQuant score",180.1100000,1.0000000,,,,1.7746400716372E-21,
SPVPESTDGSKDELNIYSQDELDDNR,ph,S,376,true,"Tissue atlas Arabidopsis - ProteomicsDB",114,32188942,"MaxQuant score",98.0330000,0.8327830,,,,1.1070000012206E-21,
SPVPESTDGSKDELNIYSQDELDDNR,ph,S,388,true,"STN8 phosphoproteome",38,21768351,"MASCOT Score",47.0700000,,,,,,-1.4820300
SPVPESTDGSKDELNIYSQDELDDNR,ph,S,388,true,"LAXIC - ABA stress",84a,23660473,XCorr,6.2600000,0.9690000,,,,1.0800000183053E-7,
SPVPESTDGSKDELNIYSQDELDDNR,ph,S,388,true,"TOR Kinase and ABA Receptor",100,29290610,XCorr,5.6168442,0.8243000,,,,1.2950000382261E-5,
SPVPESTDGSKDELNIYSQDELDDNR,ph,S,388,true,"Col-0 callus - FC Col-0 vs. Col-0 Xray",111a,31410901,,53.8900000,,0.8581937,0.0000000,NO,,1.4328463
SPVPESTDGSKDELNIYSQDELDDNR,ph,S,388,true,"Col-0 X-ray callus - FC Col-0 vs. Col-0 Xray",111b,31410901,,53.8900000,,0.8581937,0.0000000,NO,,1.4328463
SPVPESTDGSKDELNIYSQDELDDNR,ph,S,388,true,"atm callus - FC atm vs. atm Xray",111c,31410901,,53.8900000,,0.4354995,0.0000000,NO,,1.4328463
SPVPESTDGSKDELNIYSQDELDDNR,ph,S,388,true,"atm-3 X-ray callus - FC atm vs. atm Xray",111d,31410901,,53.8900000,,0.4354995,0.0000000,NO,,1.4328463
SPVPESTDGSKDELNIYSQDELDDNR,ph,S,388,true,"Tissue atlas Arabidopsis - ProteomicsDB",114,32188942,"MaxQuant score",329.3700000,1.0000000,,,,0,
SPVPESTDGSKDELNIYSQDELDDNR,ph,S,388,true,"Touch-induced phosphorylation: 40s touch vs untouc",136,30291188,"MASCOT score",109.3600000,,-0.0923188,0.6482246,NO,,7.9845947
DELNIYSQDELDDNR,ph,S,388,true,"TOR Kinase and ABA Receptor",100,29290610,XCorr,5.4841967,0.9970000,,,,3.6930000391067E-8,
DELNIYSQDELDDNR,ph,S,388,true,"Phospho cell culture sucrose/TOR",109,30833711,,,0.9945850,,,,,
VIETDTQPSDLCTR,sno,C,460,true,"S-Nitroso-Proteome guard cells - 60 min flg22",116c,32121556,,,,0.5360529,0.0070000,YES,,
EEENLALVKER,ac,K,712,true,"Quantitative Acetylproteomics",101,29440448,,,,,,,,
AEITFEKER,ac,K,749,true,"Quantitative Acetylproteomics",101,29440448,,,,,,,,
LQYELEVER,ph,Y,771,true,"atm and atr DNA damage response",88,25561503,"MASCOT Score",25.0000000,1.0000000,,,,,2.8300000
EMAGTVSGKSR,ac,K,867,true,"Quantitative Acetylproteomics",101,29440448,,,,,,,,
