Peptide,PTM,ModifiedAA,ModifiedPosition,PeptideUniqueToGene,ExperimentDesc,ExpID,PubmedID,ScoreType,IdentScore,LocProb,Log2FChange,PQ-val,QuantSig,PEP,MassErrorPPM
GTSVQVTPLCGVYN,nta,G,2,true,"HUNTER N-terminome: legumain, GluC and trypsin",119,31951383,"MaxQuant score",123.6200000,,,,,,
EEETKASHGSDDNSSEPMIIDTK,ph,S,419,true,"Tissue atlas Arabidopsis - ProteomicsDB",114,32188942,"MaxQuant score",109.4400000,0.8760000,,,,5.5551002686727E-10,
ASHGSDDNSSEPMIIDTK,ph,S,419,true,"srk2dei ABA signaling phopshoproteomics",83,23572148,"MASCOT Score",22.0000000,,,,,,-0.0005000
ASHGSDDNSSEPMIIDTK,ph,S,419,true,"Lateral root-induction - NAA vs control",106,23328941,"MASCOT Score",25.0000000,,,,,,
ASHGSDDNSSEPMIIDTK,ph,S,422,true,"Tyrosine phosphorylation in Arabidopsis",59,18463617,"MASCOT Score",44.0000000,,,,,,-0.7565093
ASHGSDDNSSEPMIIDTK,ph,S,422,true,"SnRK2 protein kinase substrates",85,23776212,XCorr,3.4458129,1.0000000,,,,0.0018380499677733,
ASHGSDDNSSEPMIIDTK,ph,S,422,true,"atm and atr DNA damage response",88,25561503,"MASCOT Score",33.0000000,1.0000000,,,,,-0.7400000
ASHGSDDNSSEPMIIDTK,ph,S,422,true,"TOR Kinase and ABA Receptor",100,29290610,XCorr,5.7868094,0.9893000,,,,7.999000217751E-7,
ASHGSDDNSSEPMIIDTK,ph,S,422,true,"Lateral root-induction - NAA vs control",106,23328941,"MASCOT Score",61.0000000,,,,,,
ASHGSDDNSSEPMIIDTK,ph,S,422,true,"Phospho cell culture sucrose/TOR",109,30833711,,,0.9999190,,,,,
ASHGSDDNSSEPMIIDTK,ph,S,422,true,"Tissue atlas Arabidopsis - ProteomicsDB",114,32188942,"MaxQuant score",427.0700000,1.0000000,,,,0,
ASHGSDDNSSEPMIIDTK,ph,S,426,true,"atm and atr DNA damage response",88,25561503,"MASCOT Score",33.0000000,1.0000000,,,,,-0.7400000
ASHGSDDNSSEPMIIDTK,ph,S,426,true,"Lateral root-induction - NAA vs control",106,23328941,"MASCOT Score",25.0000000,,,,,,
ASHGSDDNSSEPMIIDTK,ph,S,426,true,"Phospho cell culture sucrose/TOR",109,30833711,,,0.9489010,,,,,
ASHGSDDNSSEPMIIDTK,ph,S,426,true,"Tissue atlas Arabidopsis - ProteomicsDB",114,32188942,"MaxQuant score",284.5600000,0.9999960,,,,0,
ASHGSDDNSSEPMIIDTK,ph,S,427,true,"srk2dei ABA signaling phopshoproteomics",83,23572148,"MASCOT Score",22.0000000,,,,,,-0.0005000
ASHGSDDNSSEPMIIDTK,ph,S,427,true,"SnRK2 protein kinase substrates",85,23776212,XCorr,3.2535636,0.9440000,,,,0.011906299740076,
ASHGSDDNSSEPMIIDTK,ph,S,427,true,"atm and atr DNA damage response",88,25561503,"MASCOT Score",32.0000000,1.0000000,,,,,-0.5600000
ASHGSDDNSSEPMIIDTK,ph,S,427,true,"TOR Kinase and ABA Receptor",100,29290610,XCorr,5.5327249,0.8866000,,,,8.9419998403173E-5,
ASHGSDDNSSEPMIIDTK,ph,S,427,true,"Tissue atlas Arabidopsis - ProteomicsDB",114,32188942,"MaxQuant score",371.1300000,0.9999960,,,,0,
SLLPMPGAASPHKPVLVGDLK,ph,S,655,true,"Tissue atlas Arabidopsis - ProteomicsDB",114,32188942,"MaxQuant score",145.1900000,1.0000000,,,,1.7499200387714E-25,
CGEYVTLR,so,C,691,true,"S-sulfenylation site detection using YAP1C",110,32714340,,,,,,,,
