Peptide,PTM,ModifiedAA,ModifiedPosition,PeptideUniqueToGene,ExperimentDesc,ExpID,PubmedID,ScoreType,IdentScore,LocProb,Log2FChange,PQ-val,QuantSig,PEP,MassErrorPPM
QEDSKAIVPVVPK,ph,S,59,true,"Tissue atlas Arabidopsis - ProteomicsDB",114,32188942,"MaxQuant score",62.3380000,1.0000000,,,,0.011636699549854,
AIVPVVPKEVEEEKK,ub,K,68,true,"upl3 mutant / wildtype",168,35926874,"MaxQuant score",91.8120000,1.0000000,-0.6060347,,,2.0462600787141E-6,0.0817020
KEGSVNRDAVLAR,ph,S,78,true,"TOR Kinase and ABA Receptor",100,29290610,XCorr,2.1447330,1.0000000,,,,0.0090370001271367,
KEGSVNRDAVLAR,ph,S,78,true,"Tissue atlas Arabidopsis - ProteomicsDB",114,32188942,"MaxQuant score",139.4900000,1.0000000,,,,5.8091800383409E-6,
MSLIKAWEEAEK,ub,K,98,true,"upl3 mutant / wildtype",168,35926874,"MaxQuant score",80.6900000,1.0000000,,,,0.00018314400222152,-0.1269500
LSSIGSWENNKK,ph,S,121,true,"atm and atr DNA damage response",88,25561503,"MASCOT Score",42.0000000,0.9930000,,,,,0.0000000
LSSIGSWENNKK,ph,S,121,true,"Tissue atlas Arabidopsis - ProteomicsDB",114,32188942,"MaxQuant score",241.8400000,1.0000000,,,,0,
RAMIEAKR,ac,K,173,false,"Quantitative Acetylproteomics",101,29440448,,,,,,,,
AMIEAKR,me1,K,173,false,"Arabidopsis protein methylome",123,31809900,"MaxQuant Score",41.6520000,1.0000000,,,,0.01668700017035,-0.3852400
AMIEAKR,ub,K,173,false,"Arabidopsis ubiquitination COFRADIC",40,26744219,"MaxQuant Score",81.2970000,1.0000000,,,,0.0080000003799796,-0.6670000
AEELAAKYR,ac,K,187,true,"Quantitative Acetylproteomics",101,29440448,,,,,,,,
