Peptide,PTM,ModifiedAA,ModifiedPosition,PeptideUniqueToGene,ExperimentDesc,ExpID,PubmedID,ScoreType,IdentScore,LocProb,Log2FChange,PQ-val,QuantSig,PEP,MassErrorPPM
AEPEKKR,nta,A,2,true,"Arabidopsis translation initiation landscape - NTA",167a,35069635,,,,,,,,
DLYLVHDEHESPLPLTVTSR,ph,S,31,true,"Tissue atlas Arabidopsis - ProteomicsDB",114,32188942,"MaxQuant score",174.5300000,0.9999990,,,,3.7580301130709E-36,
SATYGSSGFPHR,ph,S,72,true,"Tissue atlas Arabidopsis - ProteomicsDB",114,32188942,"MaxQuant score",109.9600000,0.9042110,,,,6.7057102569379E-5,
LHRIDDMVTSAGER,ph,T,87,true,"Phosphorylation in N starvation",63,22060019,"MASCOT Score",23.0000000,,,,,,-2.0511800
LHRIDDMVTSAGER,ph,S,88,true,"Phosphorylation in N starvation",63,22060019,"MASCOT Score",23.0000000,,,,,,-2.0511800
IDDMVTSAGER,ph,S,88,true,"Tissue atlas Arabidopsis - ProteomicsDB",114,32188942,"MaxQuant score",115.2400000,0.7856340,,,,8.7872203948791E-6,
NTDPKSPPSR,ph,S,98,true,"atm and atr DNA damage response",88,25561503,"MASCOT Score",43.0000000,1.0000000,,,,,-1.4300000
NTDPKSPPSR,ph,S,98,true,"Tissue atlas Arabidopsis - ProteomicsDB",114,32188942,"MaxQuant score",193.2800000,0.9999990,,,,2.2638800014317E-13,
QSSEISLWER,ph,S,104,true,"Tissue atlas Arabidopsis - ProteomicsDB",114,32188942,"MaxQuant score",77.5220000,0.8531910,,,,4.2270599806216E-5,
QSSEISLWER,ph,S,105,true,"Tissue atlas Arabidopsis - ProteomicsDB",114,32188942,"MaxQuant score",138.0000000,0.9859110,,,,1.0677699719963E-5,
SYDTGLMSPMSDR,ph,S,406,true,"atm and atr DNA damage response",88,25561503,"MASCOT Score",42.0000000,1.0000000,,,,,-1.1800000
SYDTGLMSPMSDR,ph,S,406,true,"TOR Kinase and ABA Receptor",100,29290610,XCorr,3.1097732,0.9942000,,,,0.0022980000358075,
SYDTGLMSPMSDR,ph,S,406,true,"Lateral root-induction - NAA vs control",106,23328941,"MASCOT Score",28.0000000,,,,,,
SYDTGLMSPMSDR,ph,S,406,true,"Phospho cell culture sucrose/TOR",109,30833711,,,0.9881280,,,,,
SYDTGLMSPMSDR,ph,S,406,true,"Tissue atlas Arabidopsis - ProteomicsDB",114,32188942,"MaxQuant score",255.8500000,0.9999990,,,,0,
SYDTGLMSPMSDR,ph,S,409,true,"atm and atr DNA damage response",88,25561503,"MASCOT Score",42.0000000,1.0000000,,,,,-1.1800000
SYDTGLMSPMSDR,ph,S,409,true,"Tissue atlas Arabidopsis - ProteomicsDB",114,32188942,"MaxQuant score",112.5700000,1.0000000,,,,9.1386602434795E-5,
SVAADFHLVAIDSGVPR,ph,S,412,true,"Tissue atlas Arabidopsis - ProteomicsDB",114,32188942,"MaxQuant score",158.4500000,1.0000000,,,,1.4890600293647E-22,
EDFAVPESPSHTHGHEVNHYPSPSK,ph,S,547,true,"Tissue atlas Arabidopsis - ProteomicsDB",114,32188942,"MaxQuant score",139.1900000,0.8637760,,,,1.6893600130673E-35,
VPSDNSSDHSESDMQK,ph,S,576,true,"Tissue atlas Arabidopsis - ProteomicsDB",114,32188942,"MaxQuant score",129.3200000,0.8904340,,,,9.8558398990917E-15,
SVPRTPNSENKEDGSSPK,ph,T,587,true,"Tissue atlas Arabidopsis - ProteomicsDB",114,32188942,"MaxQuant score",128.1700000,0.9998890,,,,2.4429400559758E-13,
TPNSENKEDGSSPK,ph,S,597,true,"Large-scale phosphorylation discovery",44,23111157,XCorr,3.8300000,,,,,,
TPNSENKEDGSSPK,ph,S,598,true,"Tissue atlas Arabidopsis - ProteomicsDB",114,32188942,"MaxQuant score",177.6400000,0.9829090,,,,2.9298601639008E-17,
SRESWHGR,ph,S,604,true,"Tissue atlas Arabidopsis - ProteomicsDB",114,32188942,"MaxQuant score",82.0290000,0.9996740,,,,0.0022261599078774,
GGESLSSQR,ph,S,615,true,"atm and atr DNA damage response",88,25561503,"MASCOT Score",53.0000000,0.9950000,,,,,-0.7400000
GGESLSSQR,ph,S,618,true,"Tissue atlas Arabidopsis - ProteomicsDB",114,32188942,"MaxQuant score",91.4690000,0.9190750,,,,0.0021587600931525,
NAGLSSSSLK,ph,S,874,true,"atm and atr DNA damage response",88,25561503,"MASCOT Score",30.0000000,0.9940000,,,,,0.0400000
NAGLSSSSLK,ph,S,874,true,"Lateral root-induction - NAA vs control",106,23328941,"MASCOT Score",32.0000000,,,,,,
NAGLSSSSLK,ph,S,875,true,"atm and atr DNA damage response",88,25561503,"MASCOT Score",42.0000000,0.9950000,,,,,-0.7200000
NAGLSSSSLK,ph,S,875,true,"Lateral root-induction - NAA vs control",106,23328941,"MASCOT Score",31.0000000,,,,,,
NAGLSSSSLK,ph,S,875,true,"Tissue atlas Arabidopsis - ProteomicsDB",114,32188942,"MaxQuant score",161.9300000,0.8633700,,,,5.1568099479482E-7,
KLSSGSVDSAMNMEIQK,ph,S,890,true,"Tissue atlas Arabidopsis - ProteomicsDB",114,32188942,"MaxQuant score",250.3900000,0.9990680,,,,0,
LSSGSVDSAMNMEIQK,ph,S,893,true,"atm and atr DNA damage response",88,25561503,"MASCOT Score",41.0000000,0.9950000,,,,,0.4800000
LSSGSVDSAMNMEIQK,ph,S,893,true,"Phospho cell culture sucrose/TOR",109,30833711,,,0.8023320,,,,,
LSSGSVDSAMNMEIQK,ph,S,893,true,"Tissue atlas Arabidopsis - ProteomicsDB",114,32188942,"MaxQuant score",266.0000000,0.9999360,,,,0,
ALEALKLSTGR,ph,S,912,true,"Tissue atlas Arabidopsis - ProteomicsDB",114,32188942,"MaxQuant score",81.6320000,0.8819500,,,,0.000272520002909,
LSTGRGSSASSNSFQSHPG,ph,S,917,true,"Tissue atlas Arabidopsis - ProteomicsDB",114,32188942,"MaxQuant score",108.7500000,0.9278530,,,,9.1612400998642E-10,
GSSASSNSFQSHPG,ph,S,918,true,"Tissue atlas Arabidopsis - ProteomicsDB",114,32188942,"MaxQuant score",201.7600000,0.9774250,,,,6.1643119445649E-42,
GSSASSNSFQSHPG,ph,S,923,true,"Tissue atlas Arabidopsis - ProteomicsDB",114,32188942,"MaxQuant score",188.6300000,0.9855130,,,,1.2488900330383E-23,
