Peptide,PTM,ModifiedAA,ModifiedPosition,PeptideUniqueToGene,ExperimentDesc,ExpID,PubmedID,ScoreType,IdentScore,LocProb,Log2FChange,PQ-val,QuantSig,PEP,MassErrorPPM
LGDIGGDQYHQHVVAAYDSPQVR,ph,S,68,true,"MAPK Arabidopsis substrates",45,23172892,"MaxQuant Score",87.8020000,,,,,,
LGDIGGDQYHQHVVAAYDSPQVR,ph,S,68,true,"Tissue atlas Arabidopsis - ProteomicsDB",114,32188942,"MaxQuant score",208.4600000,1.0000000,,,,0,
WVKSSGGETAATTTTNTASAKR,ph,T,153,true,"Tyrosine phosphorylation - flg22 vs mock",105,22074104,"MASCOT Score",37.9900000,,,,,,-8.7605666
WVKSSGGETAATTTTNTASAKR,ph,S,155,true,"Tyrosine phosphorylation - flg22 vs mock",105,22074104,"MASCOT Score",36.5300000,,,,,,-8.8386891
SSGGETAATTTTNTASAKR,ac,K,157,true,"Lysine acetylation gel-based Finkemeier et al",37,21311031,i-probability,1.0000000,,,,,,
SSGGETAATTTTNTASAKR,ac,K,157,true,"Quantitative Acetylproteomics",101,29440448,,,,,,,,
NDGVEQGDEKFSGEEEEEEEDEELGGEEGFR,ph,S,178,true,"LAXIC - mannitol vs control",84b,23660473,XCorr,5.6900000,1.0000000,,,,8.0600000273989E-7,
NDGVEQGDEKFSGEEEEEEEDEELGGEEGFR,ph,S,178,true,"SnRK2 protein kinase substrates",85,23776212,XCorr,5.2529535,1.0000000,,,,1.18695001744E-11,
NDGVEQGDEKFSGEEEEEEEDEELGGEEGFR,ph,S,178,true,"Col-0 callus - FC Col-0 vs. Col-0 Xray",111a,31410901,,82.8100000,,0.1924245,0.0000000,NO,,1.3065189
NDGVEQGDEKFSGEEEEEEEDEELGGEEGFR,ph,S,178,true,"Col-0 X-ray callus - FC Col-0 vs. Col-0 Xray",111b,31410901,,82.8100000,,0.1924245,0.0000000,NO,,1.3065189
NDGVEQGDEKFSGEEEEEEEDEELGGEEGFR,ph,S,178,true,"atm callus - FC atm vs. atm Xray",111c,31410901,,82.8100000,,0.8417456,0.0000000,NO,,1.3065189
NDGVEQGDEKFSGEEEEEEEDEELGGEEGFR,ph,S,178,true,"atm-3 X-ray callus - FC atm vs. atm Xray",111d,31410901,,82.8100000,,0.8417456,0.0000000,NO,,1.3065189
FSGEEEEEEEDEELGGEEGFR,ph,S,178,true,"STN8 phosphoproteome",38,21768351,"MASCOT Score",121.3300000,,,,,,-1.7503000
DFSREDSESPMKER,ph,S,200,true,"Tissue atlas Arabidopsis - ProteomicsDB",114,32188942,"MaxQuant score",95.4140000,1.0000000,,,,7.0018802944105E-5,
DFSREDSESPMKER,ph,S,204,true,"atm and atr DNA damage response",88,25561503,"MASCOT Score",20.0000000,1.0000000,,,,,0.0900000
DFSREDSESPMKER,ph,S,204,true,"Phospho cell culture sucrose/TOR",109,30833711,,,0.9998520,,,,,
EDSESPMKER,ph,S,204,true,"Tissue atlas Arabidopsis - ProteomicsDB",114,32188942,"MaxQuant score",95.4140000,1.0000000,,,,7.0018802944105E-5,
DFSREDSESPMKER,ph,S,206,true,"atm and atr DNA damage response",88,25561503,"MASCOT Score",20.0000000,1.0000000,,,,,0.0900000
DFSREDSESPMKER,ph,S,206,true,"Phospho cell culture sucrose/TOR",109,30833711,,,0.9999890,,,,,
EDSESPMKER,ph,S,206,true,"Tissue atlas Arabidopsis - ProteomicsDB",114,32188942,"MaxQuant score",95.4140000,1.0000000,,,,7.0018802944105E-5,
EVELLGDWQSGGR,ph,S,227,true,"atm and atr DNA damage response",88,25561503,"MASCOT Score",65.0000000,1.0000000,,,,,-0.2000000
EVELLGDWQSGGR,ph,S,227,true,"Tissue atlas Arabidopsis - ProteomicsDB",114,32188942,"MaxQuant score",241.4200000,1.0000000,,,,0,
