Peptide,PTM,ModifiedAA,ModifiedPosition,PeptideUniqueToGene,ExperimentDesc,ExpID,PubmedID,ScoreType,IdentScore,LocProb,Log2FChange,PQ-val,QuantSig,PEP,MassErrorPPM
SLFASPPHE,nt,S,46,true,"N-terminal ChaFRADIC",92,26010716,"MASCOT Score",25.0900000,,,,,0.0015069999499246,
AVSIPKDQIVSSLTEVE,nt,A,58,true,"N-terminal ChaFRADIC",92,26010716,"MASCOT Score",27.5600000,,,,,0.0087019996717572,
AVSIPKDQIVSSLTEVE,nt,A,58,true,"HUNTER N-terminome: legumain, GluC and trypsin",119,31951383,"MaxQuant score",71.8880000,,,,,,
AVSIPKDQIVSSLTEVE,nt,A,58,true,"Arabidopsis translation initiation landscape - NT",167b,35069635,,,,,,,,
AVSIPKDQIVSSLTE,nt,A,58,true,"Arg/N-end rule seed, prt6 vs. Wt",99,29168982,"MASCOT Score",36.0300000,,0.4105021,0.2604372,NO,1.877999966382E-5,3.0601464
AVSIPKDQIVSSLTE,nt,A,58,true,"HUNTER N-terminome: legumain, GluC and trypsin",119,31951383,"MaxQuant score",246.2600000,,,,,,
SLTEVEKTINQVQETGSSVFDATQR,nt,S,69,true,"N-terminal ChaFRADIC",92,26010716,"MASCOT Score",42.6400000,,,,,7.8270003325831E-12,
SLTEVEKTINQVQETGSSVFDATQR,nt,S,69,true,"HUNTER N-terminome: legumain, GluC and trypsin",119,31951383,"MaxQuant score",98.9670000,,,,,,
SLTEVEKTIN,nt,S,69,true,"HUNTER N-terminome: legumain, GluC and trypsin",119,31951383,"MaxQuant score",80.6880000,,,,,,
QVQETGSSVFDATQR,nt,Q,79,true,"HUNTER N-terminome: legumain, GluC and trypsin",119,31951383,"MaxQuant score",122.4200000,,,,,,
QVQETGSSVFD,nt,Q,79,true,"HUNTER N-terminome: legumain, GluC and trypsin",119,31951383,"MaxQuant score",92.0510000,,,,,,
LDTALPIAKQAGEE,nt,L,106,true,"N-terminal ChaFRADIC",92,26010716,"MASCOT Score",46.2100000,,,,,9.2880000011064E-6,
LASPAFSEASKK,ac,K,133,true,"Histone deacetylases - hda14 vs WT (thylakoids)",98d,29061669,"MaxQuant Score",64.2000000,1.0000000,0.1630000,0.8892011,NO,0.0040000001899898,
LASPAFSEASKK,ac,K,133,true,"Quantitative Acetylproteomics",101,29440448,,,,,,,,
SGFDSEPVFN,nt,S,142,true,"N-terminal ChaFRADIC",92,26010716,"MASCOT Score",31.9600000,,,,,6.6289998358116E-5,
GYKGDLTPAQTLDLLCTK,ac,K,218,true,"Histone deacetylases - hda14 vs WT (thylakoids)",98d,29061669,"MaxQuant Score",73.1000000,1.0000000,-0.0200000,0.9954054,NO,7.7099997497498E-8,
GDLTPAQTLDLLCTK,sno,C,231,true,"hot5-4 / wildtype, FAT-switch S-nitrosoproteome",169,37277371,,,,0.5844823,0.0049948,NO,,
VISIPLEELPNK,ph,S,264,true,"SIRK1 phosphorylation",86a,23820729,"MaxQuant Score",46.6490000,1.0000000,,,,1.1480000019073,5.8190000
VISIPLEELPNK,ph,S,264,true,"SIRK1 exp - sirk1 mutant vs WT",86b,23820729,,,,0.0384325,,NO,,
VISIPLEELPNK,ph,S,264,true,"SIRK1 exp - 35S:SIRK1 vs WT",86c,23820729,,,,-2.8013463,,NO,,
TLKVLGYK,ac,K,323,true,"Histone deacetylases - hda14 vs WT (thylakoids)",98d,29061669,"MaxQuant Score",87.6000000,1.0000000,-0.5210000,0.8394600,NO,0.018999999389052,
VLGYKNCYIVTDGFSGGR,ac,K,328,true,"Histone deacetylases - hda14 vs WT (thylakoids)",98d,29061669,"MaxQuant Score",136.3000000,1.0000000,0.0730000,0.9749896,NO,3.4199998789983E-14,
NCYIVTDGFSGGR,acy,C,330,true,"Arabidopsis S-acylation atlas - Silique",163e,35681017,,,,,,,,
NCYIVTDGFSGGR,sno,C,330,true,"hot5-4 / wildtype, FAT-switch S-nitrosoproteome",169,37277371,,,,,,,,
LGTDSYNFSFAQVLSPSR,ng,N,354,true,"Conserved N-glycosylation",74,22633491,"MaxQuant Score",112.3900000,1.0000000,,,,6.7390002269924E-14,-0.2920000
IIPAASRSFGTR,ph,S,371,true,"atm and atr DNA damage response",88,25561503,"MASCOT Score",24.0000000,1.0000000,,,,,-0.2800000
IIPAASRSFGTR,ph,S,371,true,"Brassinosteroid-Regulated Phosphorylation Dynamics",94,26187819,"MaxQuant Score",138.0500000,0.9990000,,,,0.00010610000026645,1.4860000
IIPAASR,ph,S,371,true,"Phospho cell culture sucrose/TOR",109,30833711,,,1.0000000,,,,,
SFGTRSGTKFLPSSD,ph,S,373,true,"MAPK Arabidopsis substrates",45,23172892,"MaxQuant Score",58.4900000,,,,,,
SFGTRSGTKFLPSSD,ph,S,373,true,"Phosphoproteome ethylene-regulated time response",46,24043427,"MASCOT Score",57.5000000,,,,,,4.8625000
SFGTRSGTKFLPSSD,ph,S,373,true,"Chloroplast kinase substrates",60,19376835,"MASCOT Score",35.4500000,,,,,,-1.1153900
IIPAASRSFGTR,ph,S,373,true,"STN8 phosphoproteome",38,21768351,"MASCOT Score",56.2800000,,,,,,
IIPAASRSFGTR,ph,S,373,true,"atm and atr DNA damage response",88,25561503,"MASCOT Score",24.0000000,1.0000000,,,,,-0.2800000
IIPAASRSFGTR,ph,S,373,true,"Brassinosteroid-Regulated Phosphorylation Dynamics",94,26187819,"MaxQuant Score",138.0500000,0.8950000,,,,0.00010610000026645,1.4860000
SFGTRSGTKFLPSSD,ph,T,376,true,"MAPK Arabidopsis substrates",45,23172892,"MaxQuant Score",59.3450000,,,,,,
SFGTRSGTKFLPSSD,ph,T,376,true,"Phosphoproteome ethylene-regulated time response",46,24043427,"MASCOT Score",33.9300000,,,,,,-3.5601000
SFGTRSGTKFLPSSD,ph,T,376,true,"Tissue atlas Arabidopsis - ProteomicsDB",114,32188942,"MaxQuant score",154.4700000,0.9826860,,,,1.8123899950262E-11,
IIPAASRSFGTR,ph,T,376,true,"atm and atr DNA damage response",88,25561503,"MASCOT Score",24.0000000,1.0000000,,,,,-0.2800000
SFGTRSGTK,ph,T,376,true,"atm and atr DNA damage response",88,25561503,"MASCOT Score",28.0000000,1.0000000,,,,,-0.9600000
SFGTRSGTK,ph,T,376,true,"TOR Kinase and ABA Receptor",100,29290610,XCorr,2.5549848,0.9149000,,,,0.0011759999906644,
SFGTRSGTKFLPSSD,ph,S,378,true,"MAPK Arabidopsis substrates",45,23172892,"MaxQuant Score",58.4900000,,,,,,
SFGTRSGTKFLPSSD,ph,S,378,true,"Phosphoproteome ethylene-regulated time response",46,24043427,"MASCOT Score",28.4900000,,,,,,-13.3704000
SGTKFLPSSD,ph,S,378,true,"Large-scale phosphorylation discovery",44,23111157,XCorr,2.6650000,,,,,,
SGTKFLPSSD,ph,S,378,true,"Phosphoproteome ethylene-regulated time response",46,24043427,"MASCOT Score",52.7000000,,,,,,-8.0537000
SGTKFLPSSD,ph,S,378,true,"Chloroplast kinase substrates",60,19376835,"MASCOT Score",34.0100000,,,,,,-0.3004800
SGTKFLPSSD,ph,S,378,true,"atm and atr DNA damage response",88,25561503,"MASCOT Score",26.0000000,0.9350000,,,,,-0.5300000
SGTKFLPSSD,ph,S,378,true,"Tissue atlas Arabidopsis - ProteomicsDB",114,32188942,"MaxQuant score",173.7600000,0.9315980,,,,1.0181599918724E-7,
SFGTRSGTKFLPSSD,ph,T,380,true,"MAPK Arabidopsis substrates",45,23172892,"MaxQuant Score",59.3450000,,,,,,
SFGTRSGTKFLPSSD,ph,T,380,true,"Phosphoproteome ethylene-regulated time response",46,24043427,"MASCOT Score",57.5000000,,,,,,4.8625000
SFGTRSGTKFLPSSD,ph,T,380,true,"Chloroplast kinase substrates",60,19376835,"MASCOT Score",35.4500000,,,,,,-1.1153900
SGTKFLPSSD,ph,T,380,true,"Phosphoproteome ethylene-regulated time response",46,24043427,"MASCOT Score",32.8200000,,,,,,-2.7874000
SGTKFLPSSD,ph,T,380,true,"atm and atr DNA damage response",88,25561503,"MASCOT Score",38.0000000,1.0000000,,,,,-0.9600000
SGTKFLPSSD,ph,T,380,true,"Phospho cell culture sucrose/TOR",109,30833711,,,0.7982080,,,,,
SGTKFLPSSD,ph,T,380,true,"Tissue atlas Arabidopsis - ProteomicsDB",114,32188942,"MaxQuant score",196.1100000,0.9991120,,,,1.1864600556362E-13,
SFGTRSGTK,ph,T,380,true,"atm and atr DNA damage response",88,25561503,"MASCOT Score",28.0000000,1.0000000,,,,,-0.9600000
SGTKFLPSSD,ac,K,381,true,"Histone deacetylases - hda14 vs WT (thylakoids)",98d,29061669,"MaxQuant Score",83.9000000,1.0000000,2.0420000,0.1753881,NO,0.0070000002160668,
