Peptide,PTM,ModifiedAA,ModifiedPosition,PeptideUniqueToGene,ExperimentDesc,ExpID,PubmedID,ScoreType,IdentScore,LocProb,Log2FChange,PQ-val,QuantSig,PEP,MassErrorPPM
AKADKKPAEKKPAE,nt,A,2,true,"Arabidopsis translation initiation landscape - NT",167b,35069635,,,,,,,,
ADKKPAEKKPAEK,ac,K,6,true,"Histone deacetylases - hda14 vs WT (thylakoids)",98d,29061669,"MaxQuant Score",43.0000000,0.8450000,-2.5270000,0.8892011,NO,0.0060000000521541,
ADKKPAEKK,ac,K,6,true,"Histone deacetylases - apicidin vs control",98a,29061669,"MaxQuant Score",70.3000000,0.9670000,-0.0950000,0.5482770,NO,5.1999999765113E-14,
ADKKPAEKK,ac,K,6,true,"Histone deacetylases- hda14 vs WT (low light)",98c,29061669,"MaxQuant Score",88.6000000,0.9840000,-0.0050000,0.9931160,NO,0.00073999998858199,
ADKKPAEKK,ac,K,6,true,"Histone deacetylases substrates - hda14 vs WT",98e,29061669,"MaxQuant Score",59.9000000,0.8750000,-2.0360000,0.7655966,NO,0.0020000000949949,
ADKKPAEKKPAEK,ac,K,7,true,"Histone deacetylases substrates - hda14 vs WT",98e,29061669,"MaxQuant Score",67.1000000,0.8680000,1.9180000,0.9183326,NO,5.9000001783716E-5,
ADKKPAEK,ac,K,7,true,"Histone deacetylases - apicidin vs control",98a,29061669,"MaxQuant Score",70.3000000,0.9070000,-0.0950000,0.5482770,NO,5.1999999765113E-14,
ADKKPAEK,ac,K,7,true,"Histone deacetylases- hda14 vs WT (low light)",98c,29061669,"MaxQuant Score",120.3200000,0.9560000,-1.8720000,0.9885531,NO,3.8999999674161E-8,
ADKKPAEKKPAEKTPAAEPAAAAEKKPK,ac,K,11,true,"Quantitative Acetylproteomics",101,29440448,,,,,,,,
ADKKPAEKKPAEKTPAAEPAAAAEK,ac,K,11,true,"Quantitative Acetylproteomics",101,29440448,,,,,,,,
KPAEKKPAEKTPAAEPAAAAEK,ac,K,11,true,"Histone deacetylases- hda14 vs WT (low light)",98c,29061669,"MaxQuant Score",141.8300000,0.7910000,-3.1520000,0.8016781,NO,1.8000000101548E-10,
ADKKPAEKKPAEK,ac,K,11,true,"Histone deacetylases substrates - hda14 vs WT",98e,29061669,"MaxQuant Score",67.1000000,0.8130000,1.9180000,0.9183326,NO,5.9000001783716E-5,
ADKKPAEKK,ac,K,11,true,"Histone deacetylases - apicidin vs control",98a,29061669,"MaxQuant Score",70.3000000,0.9980000,-0.0950000,0.5482770,NO,5.1999999765113E-14,
ADKKPAEKK,ac,K,11,true,"Histone deacetylases- hda14 vs WT (low light)",98c,29061669,"MaxQuant Score",129.2200000,1.0000000,-0.0050000,0.9931160,NO,1.8000000101548E-10,
ADKKPAEKK,ac,K,11,true,"Histone deacetylases substrates - hda14 vs WT",98e,29061669,"MaxQuant Score",67.1000000,1.0000000,1.2240000,0.9204496,NO,5.9000001783716E-5,
AEKKPAEK,ac,K,11,false,"Histone deacetylases- hda14 vs WT (low light)",98c,29061669,"MaxQuant Score",163.4400000,1.0000000,-2.5710000,0.9885531,NO,9.999999960042E-12,
AEKKPAEK,ac,K,11,false,"Quantitative Acetylproteomics",101,29440448,,,,,,,,
ADKKPAEKKPAEKTPAAEPAAAAEKKPK,ac,K,12,true,"Quantitative Acetylproteomics",101,29440448,,,,,,,,
ADKKPAEKKPAEKTPAAEPAAAAEK,ac,K,12,true,"Quantitative Acetylproteomics",101,29440448,,,,,,,,
KPAEKKPAEKTPAAEPAAAAEKKPK,ac,K,12,true,"Quantitative Acetylproteomics",101,29440448,,,,,,,,
KPAEKKPAEK,ac,K,12,false,"Histone deacetylases- hda14 vs WT (low light)",98c,29061669,"MaxQuant Score",120.3200000,0.9120000,-0.0150000,0.9931160,NO,3.8999999674161E-8,
AEKKPAEK,ac,K,12,false,"Histone deacetylases- hda14 vs WT (low light)",98c,29061669,"MaxQuant Score",163.4400000,1.0000000,-2.5710000,0.9885531,NO,9.999999960042E-12,
AEKKPAEK,ac,K,12,false,"Quantitative Acetylproteomics",101,29440448,,,,,,,,
ADKKPAEKKPAEKTPAAEPAAAAEKKPK,ac,K,16,true,"Quantitative Acetylproteomics",101,29440448,,,,,,,,
ADKKPAEKKPAEKTPAAEPAAAAEK,ac,K,16,true,"Quantitative Acetylproteomics",101,29440448,,,,,,,,
KPAEKKPAEKTPAAEPAAAAEKKPK,ac,K,16,true,"Quantitative Acetylproteomics",101,29440448,,,,,,,,
KPAEKKPAEKTPAAEPAAAAEK,ac,K,16,true,"Histone deacetylases - apicidin vs control",98a,29061669,"MaxQuant Score",86.8000000,0.8800000,0.2960000,0.3935501,NO,1.1000000297156E-19,
KPAEKKPAEKTPAAEPAAAAEK,ac,K,16,true,"Histone deacetylases substrates - TSA vs control",98b,29061669,"MaxQuant Score",86.8000000,0.8800000,-0.0450000,0.9977001,NO,1.1000000297156E-19,
KPAEKKPAEKTPAAEPAAAAEK,ac,K,16,true,"Histone deacetylases- hda14 vs WT (low light)",98c,29061669,"MaxQuant Score",141.8300000,1.0000000,-3.1520000,0.8016781,NO,1.8000000101548E-10,
KPAEKKPAEKTPAAEPAAAAEK,ac,K,16,true,"Histone deacetylases substrates - hda14 vs WT",98e,29061669,"MaxQuant Score",95.2000000,0.9580000,2.3460000,0.8016781,NO,3.4999999535528E-19,
KPAEKTPAAEPAAAAEK,ph,T,17,true,"atm and atr DNA damage response",88,25561503,"MASCOT Score",30.0000000,1.0000000,,,,,-1.0700000
KPAEKTPAAEPAAAAEK,ph,T,17,true,"TOR Kinase and ABA Receptor",100,29290610,XCorr,4.5813422,1.0000000,,,,3.9039998227963E-5,
KPAEKTPAAEPAAAAEK,ph,T,17,true,"Tissue atlas Arabidopsis - ProteomicsDB",114,32188942,"MaxQuant score",179.3300000,1.0000000,,,,7.3582801678988E-30,
TPAAEPAAAAEK,ph,T,17,true,"TOR Kinase and ABA Receptor",100,29290610,XCorr,2.8523607,1.0000000,,,,0.0085659995675087,
ADKKPAEKKPAEKTPAAEPAAAAEKKPK,ac,K,28,true,"Quantitative Acetylproteomics",101,29440448,,,,,,,,
KPAEKKPAEKTPAAEPAAAAEKKPK,ac,K,28,true,"Quantitative Acetylproteomics",101,29440448,,,,,,,,
TPAAEPAAAAEKK,ac,K,28,true,"Histone deacetylases - apicidin vs control",98a,29061669,"MaxQuant Score",138.9000000,1.0000000,0.2960000,0.3935501,NO,7.6000001879583E-23,
TPAAEPAAAAEKK,ac,K,28,true,"Histone deacetylases substrates - TSA vs control",98b,29061669,"MaxQuant Score",138.9000000,1.0000000,2.1900000,0.0318420,YES,7.6000001879583E-23,
TPAAEPAAAAEKK,ac,K,28,true,"Histone deacetylases- hda14 vs WT (low light)",98c,29061669,"MaxQuant Score",133.4100000,1.0000000,-1.3440000,0.9885531,NO,2.5999999930804E-9,
TPAAEPAAAAEKK,ac,K,28,true,"Histone deacetylases substrates - hda14 vs WT",98e,29061669,"MaxQuant Score",95.2000000,1.0000000,1.2220000,0.8016781,NO,3.4999999535528E-19,
AGKKLPKEPAGAGDK,ac,K,34,true,"Histone deacetylases - apicidin vs control",98a,29061669,"MaxQuant Score",109.0000000,1.0000000,1.6830000,0.0008375,YES,0.0010000000474975,
AGKKLPKEPAGAGDK,ac,K,34,true,"Histone deacetylases substrates - TSA vs control",98b,29061669,"MaxQuant Score",109.0000000,1.0000000,4.9050000,0.0062517,YES,0.0010000000474975,
AGKKLPKEPAGAGDK,ac,K,34,true,"Histone deacetylases substrates - hda14 vs WT",98e,29061669,"MaxQuant Score",75.2000000,1.0000000,-0.1580000,0.9099133,NO,0.0099999997764826,
AGKKLPK,ac,K,34,false,"Histone deacetylases- hda14 vs WT (low light)",98c,29061669,"MaxQuant Score",73.2600000,1.0000000,2.1740000,0.9885531,NO,0.046999998390675,
AGKKLPK,ac,K,34,false,"Histone deacetylases - hda14 vs WT (thylakoids)",98d,29061669,"MaxQuant Score",85.2000000,1.0000000,-0.0500000,0.9954054,NO,0.0080000003799796,
AGKKLPK,ac,K,34,false,"Quantitative Acetylproteomics",101,29440448,,,,,,,,
AGKKLPKEPAGAGDK,ac,K,35,true,"Histone deacetylases - apicidin vs control",98a,29061669,"MaxQuant Score",109.0000000,1.0000000,1.6830000,0.0008375,YES,0.0010000000474975,
AGKKLPKEPAGAGDK,ac,K,35,true,"Histone deacetylases substrates - TSA vs control",98b,29061669,"MaxQuant Score",109.0000000,1.0000000,4.9050000,0.0062517,YES,0.0010000000474975,
AGKKLPKEPAGAGDK,ac,K,35,true,"Histone deacetylases substrates - hda14 vs WT",98e,29061669,"MaxQuant Score",75.2000000,1.0000000,-0.1580000,0.9099133,NO,0.0099999997764826,
AGKKLPK,ac,K,35,false,"Histone deacetylases- hda14 vs WT (low light)",98c,29061669,"MaxQuant Score",73.2600000,1.0000000,2.1740000,0.9885531,NO,0.046999998390675,
AGKKLPK,ac,K,35,false,"Histone deacetylases - hda14 vs WT (thylakoids)",98d,29061669,"MaxQuant Score",85.2000000,1.0000000,-0.0500000,0.9954054,NO,0.0080000003799796,
AGKKLPK,ac,K,35,false,"Quantitative Acetylproteomics",101,29440448,,,,,,,,
AGKKLPKEPAGAGDK,ac,K,38,true,"Histone deacetylases - apicidin vs control",98a,29061669,"MaxQuant Score",109.0000000,1.0000000,1.6830000,0.0008375,YES,0.0010000000474975,
AGKKLPKEPAGAGDK,ac,K,38,true,"Histone deacetylases substrates - TSA vs control",98b,29061669,"MaxQuant Score",109.0000000,1.0000000,4.9050000,0.0062517,YES,0.0010000000474975,
AGKKLPKEPAGAGDK,ac,K,38,true,"Histone deacetylases substrates - hda14 vs WT",98e,29061669,"MaxQuant Score",75.2000000,1.0000000,-0.1580000,0.9099133,NO,0.0099999997764826,
NVETYKIYIFK,cr,K,59,false,"Open search Plant PTM Viewer 2.0 - Crotonylation",164c,TBA,,,,,,,,
IYIFKVLK,ac,K,64,false,"Quantitative Acetylproteomics",101,29440448,,,,,,,,
VLKQVHPDIGISSK,ac,K,67,false,"Histone deacetylases - hda14 vs WT (thylakoids)",98d,29061669,"MaxQuant Score",50.9000000,1.0000000,0.6080000,0.8394600,NO,0.00059100001817569,
VLKQVHPDIGISSK,hib,K,67,false,"Histone Khib and acetylation, dark-induced starvat",137,34165567,,,1.0000000,,,,,
VLKQVHPDIGISSK,ub,K,67,false,"upl3 mutant / wildtype",168,35926874,"MaxQuant score",125.2200000,1.0000000,1.2892443,0.1578840,NO,1.7604800461868E-7,0.4522500
QVHPDIGISSK,ph,S,77,false,"atm and atr DNA damage response",88,25561503,"MASCOT Score",32.0000000,0.9950000,,,,,-0.6200000
QVHPDIGISSK,ph,S,77,false,"Tissue atlas Arabidopsis - ProteomicsDB",114,32188942,"MaxQuant score",116.0600000,0.8773470,,,,2.8762500733137E-5,
YNKKPTITSR,hib,K,106,false,"Histone Khib and acetylation, dark-induced starvat",137,34165567,,,0.9963720,,,,,
YNKKPTITSR,ub,K,106,false,"Arabidopsis ubiquitination COFRADIC",40,26744219,"MaxQuant Score",110.5400000,1.0000000,,,,3.7299998894014E-6,0.9450000
KPTITSR,hib,K,107,false,"Histone Khib and acetylation, dark-induced starvat",137,34165567,,,1.0000000,,,,,
YNKKPTITSR,ub,K,107,false,"Arabidopsis ubiquitination COFRADIC",40,26744219,"MaxQuant Score",110.5400000,1.0000000,,,,3.7299998894014E-6,0.9450000
KPTITSREIQTAVR,ph,S,112,false,"atm and atr DNA damage response",88,25561503,"MASCOT Score",30.0000000,0.9340000,,,,,0.0100000
LVLPGELAKHAVSEGTKAVTK,nt,L,121,false,"Arabidopsis translation initiation landscape - NT",167b,35069635,,,,,,,,
LVLPGELAKHAVSEGTK,ac,K,129,false,"Histone deacetylases - apicidin vs control",98a,29061669,"MaxQuant Score",124.3000000,1.0000000,-0.0750000,0.7345139,NO,8.2999996171796E-15,
LVLPGELAKHAVSEGTK,ac,K,129,false,"Histone deacetylases- hda14 vs WT (low light)",98c,29061669,"MaxQuant Score",108.1400000,1.0000000,0.0950000,0.9931160,NO,1.2999999853491E-5,
LVLPGELAKHAVSEGTK,ac,K,129,false,"Histone deacetylases - hda14 vs WT (thylakoids)",98d,29061669,"MaxQuant Score",102.9000000,1.0000000,0.1910000,0.9571941,NO,5.5200000820266E-11,
LVLPGELAKHAVSEGTK,ac,K,129,false,"Histone deacetylases substrates - hda14 vs WT",98e,29061669,"MaxQuant Score",63.7000000,1.0000000,0.0650000,0.9289664,NO,6.7000000854023E-5,
LVLPGELAKHAVSEGTK,ac,K,129,false,"Quantitative Acetylproteomics",101,29440448,,,,,,,,
LVLPGELAKHAVSEGTK,hib,K,129,false,"Histone Khib and acetylation, dark-induced starvat",137,34165567,,,1.0000000,,,,,
LVLPGELAKHAVSEGTK,hib,K,129,false,"Open search Plant PTM Viewer 2.0 - hib",164e,TBA,,,,,,,,
LVLPGELAKHAVSEGTK,ub,K,129,false,"upl3 mutant / wildtype",168,35926874,"MaxQuant score",98.0620000,1.0000000,1.3487990,0.1497420,NO,7.3625000140964E-7,0.0573550
VSEGTKAVTKFTSS,nt,V,132,false,"Arabidopsis translation initiation landscape - NT",167b,35069635,,,,,,,,
HAVSEGTKAVTK,hib,K,137,false,"Histone Khib and acetylation, dark-induced starvat",137,34165567,,,1.0000000,,,,,
HAVSEGTKAVTK,sumo,K,137,false,"SUMO Ligase SIZ1 heat stress",4,29588388,,,,,,,,
HAVSEGTKAVTK,ub,K,137,false,"Ubiquitination Membrane Proteins",120,33585938,,,,,,,,
AVTKFTSS,ub,K,141,false,"Ubiquitination Membrane Proteins",120,33585938,,,,,,,,
AVTKFTSS,ub,K,141,false,"upl3 mutant / wildtype",168,35926874,"MaxQuant score",72.7890000,1.0000000,-0.9517638,0.3508800,NO,0.034909099340439,0.9045000
AVTKFTS,ub,K,141,false,"Ubiquitination Membrane Proteins",120,33585938,,,,,,,,
