Peptide,PTM,ModifiedAA,ModifiedPosition,PeptideUniqueToGene,ExperimentDesc,ExpID,PubmedID,ScoreType,IdentScore,LocProb,Log2FChange,PQ-val,QuantSig,PEP,MassErrorPPM
CVGSDVVTGEISGR,acy,C,63,true,"Arabidopsis S-acylation atlas - Seedling",163d,35681017,,,,,,,,
VGSDVVTGEISGR,nt,V,64,true,"Arg/N-end rule pathway Roots",80,25728785,"MASCOT Score",41.2500000,,,,,0.00027389999013394,
VGSDVVTGEISGR,nt,V,64,true,"Arg/N-end rule seed, prt6 vs. Wt",99,29168982,"MASCOT Score",67.8700000,,,,,0.0026310000102967,-0.9871213
VGSDVVTGE,nt,V,64,true,"Arg/N-end rule seed, prt6 vs. Wt",99,29168982,"MASCOT Score",55.7200000,,0.0369097,0.9131542,NO,0.00031850000959821,2.4046278
VGSDVVTGEISGR,nta,V,64,true,"Characterization plant N-terminal acetylation",6,22223895,"MASCOT Score",90.6300000,,,,,,
VGSDVVTGEISGR,nta,V,64,true,"Arg/N-end rule seed, prt6 vs. Wt",99,29168982,"MASCOT Score",67.8700000,,,,,0.0026310000102967,-0.9871213
ACASLPSSVFEAERPGCK,so,C,292,true,"Arabidopsis S-sulfenylation chemoproteomics",108,31578252,"pFind PSM Score",0.0053556,,0.7651900,,,,-1.3291658
ACASLPSSVFEAERPGCK,sno,C,307,true,"hot5-4 / wildtype, FAT-switch S-nitrosoproteome",169,37277371,,,,0.2526177,0.0246665,NO,,
