Peptide,PTM,ModifiedAA,ModifiedPosition,PeptideUniqueToGene,ExperimentDesc,ExpID,PubmedID,ScoreType,IdentScore,LocProb,Log2FChange,PQ-val,QuantSig,PEP,MassErrorPPM
ANEELTESQQQEDPSQQLPN,nt,A,2,true,"Arg/N-end rule seed, prt6 vs. Wt",99,29168982,"MASCOT Score",52.2900000,,0.0169135,0.9631797,NO,0.0029750000685453,-2.1147629
ANEELTESQQQEDPSQQLPN,nt,A,2,true,"HUNTER N-terminome: legumain, GluC and trypsin",119,31951383,"MaxQuant score",112.5800000,,,,,,
ANEELTESQ,nt,A,2,true,"Arg/N-end rule seed, prt6 vs. Wt",99,29168982,"MASCOT Score",62.5100000,,0.0710016,0.5760687,NO,0.027310000732541,0.6070963
MHGCGVYEVNER,ox,C,349,true,"OxiTRAQ Arabidopsis - 5 mM H2O2 versus control",47,24376095,,,,-0.0560670,0.6481413,NO,,
MHGCGVYEVNER,sno,C,349,true,"hot5-4 / wildtype, FAT-switch S-nitrosoproteome",169,37277371,,,,,,,,
IINYVEDEKHGIR,ac,K,528,true,"Quantitative Acetylproteomics",101,29440448,,,,,,,,
TEMGLTEEDEDVLVPVYKEEK,ph,T,644,true,"Tissue atlas Arabidopsis - ProteomicsDB",114,32188942,"MaxQuant score",59.3240000,0.7624300,,,,0.0012629400007427,
KTEMGLTEEDEDVLVPVYK,ph,T,644,true,"Chloroplast kinase substrates",60,19376835,"MASCOT Score",36.6000000,,,,,,-0.1277390
KTEMGLTEEDEDVLVPVYKEEK,ph,T,649,true,"Chloroplast kinase substrates",60,19376835,"MASCOT Score",49.9900000,,,,,,-0.6844920
KTEMGLTEEDEDVLVPVYK,ph,T,649,true,"TOR Kinase and ABA Receptor",100,29290610,XCorr,5.2357001,1.0000000,,,,4.6149999377576E-9,
KTEMGLTEEDEDVLVPVYK,ph,T,649,true,"Tissue atlas Arabidopsis - ProteomicsDB",114,32188942,"MaxQuant score",170.1100000,0.9999940,,,,0,
