Peptide,PTM,ModifiedAA,ModifiedPosition,PeptideUniqueToGene,ExperimentDesc,ExpID,PubmedID,ScoreType,IdentScore,LocProb,Log2FChange,PQ-val,QuantSig,PEP,MassErrorPPM
SSSLQDQFTVETTKR,nt,S,35,true,"N-terminal ChaFRADIC",92,26010716,"MASCOT Score",37.4500000,,,,,7.360999830508E-12,
SSSLQDQFTVETTKR,nt,S,35,true,"Stromal N-terminome",96,26371235,"MASCOT Score",48.9500000,,,,,,
SSSLQDQFTVETTKR,nt,S,35,true,"Arabidopsis translation initiation landscape - NT",167b,35069635,,,,,,,,
SSSLQDQFTVE,nt,S,35,true,"N-terminal ChaFRADIC",92,26010716,"MASCOT Score",50.5200000,,,,,1.0609999662847E-5,
SSSLQDQFTVE,nt,S,35,true,"HUNTER N-terminome: legumain, GluC and trypsin",119,31951383,"MaxQuant score",90.6290000,,,,,,
SSSLQDQFTVETTKR,nta,S,35,true,"N-terminal ChaFRADIC",92,26010716,"MASCOT Score",33.0100000,,,,,2.8979999115109E-5,
SLQDQFTVE,nt,S,37,true,"N-terminal ChaFRADIC",92,26010716,"MASCOT Score",28.0700000,,,,,0.024769999086857,
ADGGSPHVCLNR,sno,C,242,true,"Site-specific nitrosomeproteomic id - gsnor1-3",90a,25699590,XCorr,2.8238678,,,,,0.0025100000202656,-6.3777008
ADGGSPHVCLNR,sno,C,242,true,"Site-specific nitrosomeproteomic id - gsnor1-3",90b,25699590,XCorr,2.5700000,,,,,0.13650000095367,-5.8000000
LNQTPNSPLAGGSSGGR,ph,S,252,true,"Tissue atlas Arabidopsis - ProteomicsDB",114,32188942,"MaxQuant score",70.6280000,0.9951380,,,,0.00051466398872435,
LNQTPNSPLAGGSSGGR,ph,S,258,true,"Tissue atlas Arabidopsis - ProteomicsDB",114,32188942,"MaxQuant score",81.6560000,0.8216770,,,,0.00023922200489324,
VQEAAGCLGVDNVPHYVK,sno,C,341,true,"hot5-4 / wildtype, FAT-switch S-nitrosoproteome",169,37277371,,,,,,,,
