Peptide,PTM,ModifiedAA,ModifiedPosition,PeptideUniqueToGene,ExperimentDesc,ExpID,PubmedID,ScoreType,IdentScore,LocProb,Log2FChange,PQ-val,QuantSig,PEP,MassErrorPPM
MDNKNDQDIDVRSVVE,nta,M,1,true,"Arg/N-end rule seed, prt6 vs. Wt",99,29168982,"MASCOT Score",20.0300000,,0.0083670,0.9873161,NO,0.044149998575449,-2.0582935
MDNKNDQDIDVR,nta,M,1,true,"Arg/N-end rule pathway Roots",80,25728785,"MASCOT Score",46.3700000,,,,,9.5269999292213E-5,
MDNKNDQDIDVR,nta,M,1,true,"Arg/N-end rule seed, prt6 vs. Wt",99,29168982,"MASCOT Score",43.5500000,,0.1331361,0.5211702,NO,0.0065919999033213,-0.9208992
MDNKNDQDIDVR,nta,M,1,true,"Arabidopsis translation initiation landscape - NTA",167a,35069635,,,,,,,,
MDNKNDQDID,nta,M,1,true,"N-term acetylation drought responses",5,26184543,,,,,,,,
QQATLGYVANPSQAGQSE,nt,Q,214,true,"HUNTER N-terminome: legumain, GluC and trypsin",119,31951383,"MaxQuant score",103.8500000,,,,,,
AIAQSNSTDISDNLFR,ph,S,263,false,"Tissue atlas Arabidopsis - ProteomicsDB",114,32188942,"MaxQuant score",188.4400000,0.9603380,,,,2.4596399913089E-27,
VHGFTFGDSMEESK,ph,S,403,true,"Tissue atlas Arabidopsis - ProteomicsDB",114,32188942,"MaxQuant score",114.0600000,0.9995590,,,,1.540919947729E-5,
