Peptide,PTM,ModifiedAA,ModifiedPosition,PeptideUniqueToGene,ExperimentDesc,ExpID,PubmedID,ScoreType,IdentScore,LocProb,Log2FChange,PQ-val,QuantSig,PEP,MassErrorPPM
ASSEDNSFGMSHPRPSPPVATEELK,ph,S,56,true,"Tissue atlas Arabidopsis - ProteomicsDB",114,32188942,"MaxQuant score",105.9000000,0.9792460,,,,8.9470096713195E-18,
MDAATFDKVR,ac,K,135,true,"Histone deacetylases - apicidin vs control",98a,29061669,"MaxQuant Score",97.7000000,1.0000000,2.1120000,0.0005164,YES,8.8000000687316E-5,
MDAATFDKVR,ac,K,135,true,"Histone deacetylases substrates - TSA vs control",98b,29061669,"MaxQuant Score",97.7000000,1.0000000,3.8030000,0.0062517,YES,8.8000000687316E-5,
MDAATFDKVR,ac,K,135,true,"Histone deacetylases substrates - hda14 vs WT",98e,29061669,"MaxQuant Score",68.5000000,1.0000000,0.1390000,0.9120108,NO,0.0010000000474975,
GSDSPPSVSGESVR,ph,S,192,true,"TOR Kinase and ABA Receptor",100,29290610,XCorr,3.2655981,0.9895000,,,,6.0279999161139E-5,
GSDSPPSVSGESVR,ph,S,192,true,"Phospho cell culture sucrose/TOR",109,30833711,,,0.9355480,,,,,
GSDSPPSVSGESVR,ph,S,192,true,"Tissue atlas Arabidopsis - ProteomicsDB",114,32188942,"MaxQuant score",180.5400000,0.9965360,,,,1.2112099656826E-22,
GSDSPPSVSGESVR,ph,S,197,true,"Tissue atlas Arabidopsis - ProteomicsDB",114,32188942,"MaxQuant score",103.1300000,0.9664700,,,,9.2074398708064E-5,
SKSSPGVSGINR,ph,S,265,true,"atm and atr DNA damage response",88,25561503,"MASCOT Score",27.0000000,0.9930000,,,,,-0.6800000
SKSSPGVSGINR,ph,S,265,true,"Tissue atlas Arabidopsis - ProteomicsDB",114,32188942,"MaxQuant score",162.9600000,0.9929030,,,,5.9461302548414E-10,
LDTSFEPDSPCMGALSR,ph,S,282,true,"Tissue atlas Arabidopsis - ProteomicsDB",114,32188942,"MaxQuant score",176.8100000,0.9999850,,,,4.7557101293642E-23,
NLLDDSPTNSSTAILK,ph,S,323,true,"atm and atr DNA damage response",88,25561503,"MASCOT Score",42.0000000,1.0000000,,,,,0.0200000
NLLDDSPTNSSTAILK,ph,S,323,true,"Tissue atlas Arabidopsis - ProteomicsDB",114,32188942,"MaxQuant score",240.5300000,0.9998910,,,,0,
NLLDDSPTNSSTAILK,ph,S,327,true,"Tissue atlas Arabidopsis - ProteomicsDB",114,32188942,"MaxQuant score",160.7600000,0.8018530,,,,6.0916901948108E-14,
NLLDDSPTNSSTAILKGKVSR,ac,K,333,true,"Histone deacetylases - apicidin vs control",98a,29061669,"MaxQuant Score",140.5000000,1.0000000,6.0680000,0.0001611,YES,0,
NLLDDSPTNSSTAILKGKVSR,ac,K,335,true,"Histone deacetylases - apicidin vs control",98a,29061669,"MaxQuant Score",140.5000000,1.0000000,6.0680000,0.0001611,YES,0,
VDSPSGVLQGSSAHAMAQWVGQRPHK,ph,S,356,true,"Tissue atlas Arabidopsis - ProteomicsDB",114,32188942,"MaxQuant score",104.9100000,0.9548520,,,,3.1880900930212E-22,
TNVVSPVIK,ph,S,390,true,"Tissue atlas Arabidopsis - ProteomicsDB",114,32188942,"MaxQuant score",133.7900000,1.0000000,,,,0.00010733400267782,
ISGQGFATSDFSPR,ph,S,411,true,"SnRK2 protein kinase substrates",85,23776212,XCorr,2.0050161,0.9980000,,,,0.03690730035305,
ISGQGFATSDFSPR,ph,S,411,true,"Tissue atlas Arabidopsis - ProteomicsDB",114,32188942,"MaxQuant score",269.2700000,0.9998130,,,,0,
ASPGTTGPLSVVDSSPLK,ph,S,415,true,"STN8 phosphoproteome",38,21768351,"MASCOT Score",52.0700000,,,,,,-1.5081200
ASPGTTGPLSVVDSSPLK,ph,S,415,true,"atm and atr DNA damage response",88,25561503,"MASCOT Score",33.0000000,0.9990000,,,,,0.9200000
ASPGTTGPLSVVDSSPLK,ph,S,415,true,"Tissue atlas Arabidopsis - ProteomicsDB",114,32188942,"MaxQuant score",171.2900000,0.9998040,,,,1.1852699619599E-27,
ASPGTTGPLSVVDSSPLK,ph,S,415,true,"Touch-induced phosphorylation: 40s touch vs untouc",136,30291188,"MASCOT score",91.5800000,,-0.2694683,0.8371599,NO,,4.1519206
ASPGTTGPLSVVDSSPLK,ph,S,428,true,"Tissue atlas Arabidopsis - ProteomicsDB",114,32188942,"MaxQuant score",160.6200000,0.7736050,,,,1.29959000351E-21,
NASSPYGLSESEDSGAGDNK,ph,S,441,true,"Tissue atlas Arabidopsis - ProteomicsDB",114,32188942,"MaxQuant score",174.2000000,0.9741740,,,,1.5926100264282E-35,
NASSPYGLSESEDSGAGDNK,ph,S,446,true,"Tissue atlas Arabidopsis - ProteomicsDB",114,32188942,"MaxQuant score",107.2100000,0.9748770,,,,5.6191401358319E-13,
IQTSHKGGGAWKQGK,ac,K,491,true,"Histone deacetylases- hda14 vs WT (low light)",98c,29061669,"MaxQuant Score",95.2000000,1.0000000,-0.0630000,0.9931160,NO,0.00026999998954125,
IQTSHKGGGAWKQGK,ac,K,491,true,"Quantitative Acetylproteomics",101,29440448,,,,,,,,
IQTSHKGGGAWKQGK,ac,K,497,true,"Histone deacetylases- hda14 vs WT (low light)",98c,29061669,"MaxQuant Score",95.2000000,1.0000000,-0.0630000,0.9931160,NO,0.00026999998954125,
IQTSHKGGGAWKQGK,ac,K,497,true,"Quantitative Acetylproteomics",101,29440448,,,,,,,,
QGKSESVSSLTTPGFHPIMVK,ac,K,500,true,"Quantitative Acetylproteomics",101,29440448,,,,,,,,
SENLPVEKPFHNIKIASDKNR,ac,K,526,true,"Histone deacetylases - apicidin vs control",98a,29061669,"MaxQuant Score",108.5000000,1.0000000,3.9560000,0.0046989,YES,5.7999999654292E-26,
SENLPVEKPFHNIKIASDKNR,ac,K,526,true,"Histone deacetylases substrates - TSA vs control",98b,29061669,"MaxQuant Score",108.5000000,1.0000000,3.6460000,0.1845015,NO,5.7999999654292E-26,
SENLPVEKPFHNIKIASDKNR,ac,K,526,true,"Histone deacetylases substrates - hda14 vs WT",98e,29061669,"MaxQuant Score",79.7000000,1.0000000,0.6840000,0.7925013,NO,5.9999997591847E-13,
SENLPVEKPFHNIKIASDK,ac,K,526,true,"Quantitative Acetylproteomics",101,29440448,,,,,,,,
SENLPVEKPFHNIKIASDKNR,ac,K,532,true,"Histone deacetylases - apicidin vs control",98a,29061669,"MaxQuant Score",108.5000000,1.0000000,3.9560000,0.0046989,YES,5.7999999654292E-26,
SENLPVEKPFHNIKIASDKNR,ac,K,532,true,"Histone deacetylases substrates - TSA vs control",98b,29061669,"MaxQuant Score",108.5000000,1.0000000,3.6460000,0.1845015,NO,5.7999999654292E-26,
SENLPVEKPFHNIKIASDKNR,ac,K,532,true,"Histone deacetylases substrates - hda14 vs WT",98e,29061669,"MaxQuant Score",79.7000000,1.0000000,0.6840000,0.7925013,NO,5.9999997591847E-13,
SENLPVEKPFHNIKIASDKNR,ac,K,532,true,"Quantitative Acetylproteomics",101,29440448,,,,,,,,
SENLPVEKPFHNIKIASDK,ac,K,532,true,"Quantitative Acetylproteomics",101,29440448,,,,,,,,
SENLPVEKPFHNIKIASDKNR,ac,K,537,true,"Histone deacetylases - apicidin vs control",98a,29061669,"MaxQuant Score",108.5000000,1.0000000,3.9560000,0.0046989,YES,5.7999999654292E-26,
SENLPVEKPFHNIKIASDKNR,ac,K,537,true,"Histone deacetylases substrates - TSA vs control",98b,29061669,"MaxQuant Score",108.5000000,1.0000000,3.6460000,0.1845015,NO,5.7999999654292E-26,
SENLPVEKPFHNIKIASDKNR,ac,K,537,true,"Histone deacetylases substrates - hda14 vs WT",98e,29061669,"MaxQuant Score",79.7000000,1.0000000,0.6840000,0.7925013,NO,5.9999997591847E-13,
SENLPVEKPFHNIKIASDKNR,ac,K,537,true,"Quantitative Acetylproteomics",101,29440448,,,,,,,,
SKYGRPPAKK,ac,K,541,true,"Quantitative Acetylproteomics",101,29440448,,,,,,,,
SKYGRPPAKK,ac,K,548,true,"Quantitative Acetylproteomics",101,29440448,,,,,,,,
YGRPPAKKVK,ac,K,548,true,"Quantitative Acetylproteomics",101,29440448,,,,,,,,
YGRPPAKKVK,ac,K,549,true,"Quantitative Acetylproteomics",101,29440448,,,,,,,,
LASNANTPSDITGESDDDREDIFAAANSAR,ph,S,573,true,"Phospho cell culture sucrose/TOR",109,30833711,,,0.9631800,,,,,
LASNANTPSDITGESDDDREDIFAAANSAR,ph,S,573,true,"Tissue atlas Arabidopsis - ProteomicsDB",114,32188942,"MaxQuant score",203.2100000,0.9993720,,,,0,
GSKAAKVNKVTR,ac,K,924,true,"Histone deacetylases - apicidin vs control",98a,29061669,"MaxQuant Score",130.7000000,1.0000000,5.3760000,0.0033113,YES,2.4000000848901E-6,
GSKAAKVNK,ac,K,924,true,"Quantitative Acetylproteomics",101,29440448,,,,,,,,
GSKAAKVNKVTR,ac,K,927,true,"Histone deacetylases - apicidin vs control",98a,29061669,"MaxQuant Score",130.7000000,1.0000000,5.3760000,0.0033113,YES,2.4000000848901E-6,
GSKAAKVNK,ac,K,927,true,"Quantitative Acetylproteomics",101,29440448,,,,,,,,
GSKAAKVNKVTR,ac,K,930,true,"Histone deacetylases - apicidin vs control",98a,29061669,"MaxQuant Score",130.7000000,1.0000000,5.3760000,0.0033113,YES,2.4000000848901E-6,
SSENGGSGTASNTLNEPSNHQAEAK,ph,S,977,true,"Tissue atlas Arabidopsis - ProteomicsDB",114,32188942,"MaxQuant score",174.4700000,0.7743510,,,,0,
GSGAVSSTKR,ac,K,1010,true,"Quantitative Acetylproteomics",101,29440448,,,,,,,,
VTTSKGSAVLSGGGAQGKR,ac,K,1031,true,"Histone deacetylases - apicidin vs control",98a,29061669,"MaxQuant Score",140.9000000,1.0000000,0.5900000,0.0963829,NO,0,
VTTSKGSAVLSGGGAQGKR,ac,K,1031,true,"Histone deacetylases- hda14 vs WT (low light)",98c,29061669,"MaxQuant Score",123.8300000,1.0000000,0.3230000,0.9885531,NO,2.3999999143598E-7,
VTTSKGSAVLSGGGAQGKR,ac,K,1031,true,"Histone deacetylases substrates - hda14 vs WT",98e,29061669,"MaxQuant Score",103.9000000,1.0000000,0.3470000,0.8016781,NO,2.1999999443836E-24,
VTTSKGSAVLSGGGAQGKR,ac,K,1031,true,"Quantitative Acetylproteomics",101,29440448,,,,,,,,
VTTSKGSAVLSGGGAQGKR,ac,K,1044,true,"Histone deacetylases - apicidin vs control",98a,29061669,"MaxQuant Score",140.9000000,1.0000000,0.5900000,0.0963829,NO,0,
VTTSKGSAVLSGGGAQGKR,ac,K,1044,true,"Histone deacetylases- hda14 vs WT (low light)",98c,29061669,"MaxQuant Score",123.8300000,1.0000000,0.3230000,0.9885531,NO,2.3999999143598E-7,
VTTSKGSAVLSGGGAQGKR,ac,K,1044,true,"Histone deacetylases substrates - hda14 vs WT",98e,29061669,"MaxQuant Score",103.9000000,1.0000000,0.3470000,0.8016781,NO,2.1999999443836E-24,
VTTSKGSAVLSGGGAQGKR,ac,K,1044,true,"Quantitative Acetylproteomics",101,29440448,,,,,,,,
GSAVLSGGGAQGKR,ac,K,1044,true,"Quantitative Acetylproteomics",101,29440448,,,,,,,,
GVTSGDGAVDDEAPIDFSKLAFR,ac,K,1111,true,"Histone deacetylases substrates - TSA vs control",98b,29061669,"MaxQuant Score",80.4000000,1.0000000,3.1190000,0.0422669,YES,1.1000000389727E-11,
