Peptide,PTM,ModifiedAA,ModifiedPosition,PeptideUniqueToGene,ExperimentDesc,ExpID,PubmedID,ScoreType,IdentScore,LocProb,Log2FChange,PQ-val,QuantSig,PEP,MassErrorPPM
MNSLTVEQVLK,nta,M,1,true,"Characterization plant N-terminal acetylation",6,22223895,"MASCOT Score",47.5800000,,,,,,
GNPISDNDKSAKKVR,ub,K,240,true,"Arabidopsis ubiquitination COFRADIC",40,26744219,"MaxQuant Score",40.4930000,0.9060000,,,,0.0049999998882413,0.9260000
GNPISDNDKSAKKVR,ub,K,243,true,"Arabidopsis ubiquitination COFRADIC",40,26744219,"MaxQuant Score",71.0800000,0.8300000,,,,2.3770001007506E-6,0.2730000
HIRLDTDDETFDAYHNK,ph,T,275,true,"TOR Kinase and ABA Receptor",100,29290610,XCorr,5.1297207,1.0000000,,,,4.7520001089651E-7,
HIRLDTDDETFDAYHNK,ph,T,275,true,"Phospho cell culture sucrose/TOR",109,30833711,,,1.0000000,,,,,
LDTDDETFDAYHNK,ph,T,275,true,"SnRK2 protein kinase substrates",85,23776212,XCorr,3.4502180,0.9650000,,,,3.6244198753366E-8,
LDTDDETFDAYHNK,ph,T,275,true,"atm and atr DNA damage response",88,25561503,"MASCOT Score",80.0000000,1.0000000,,,,,-0.2200000
LDTDDETFDAYHNK,ph,T,275,true,"TOR Kinase and ABA Receptor",100,29290610,XCorr,4.8917418,1.0000000,,,,8.3029997767881E-5,
LDTDDETFDAYHNK,ph,T,275,true,"Tissue atlas Arabidopsis - ProteomicsDB",114,32188942,"MaxQuant score",363.3700000,1.0000000,,,,0,
LDTDDETFDAYHNK,ph,T,279,true,"Tissue atlas Arabidopsis - ProteomicsDB",114,32188942,"MaxQuant score",58.2460000,0.9953460,,,,0.0023057200014591,
RNKSEEEEVNNEDHK,ph,S,308,true,"TOR Kinase and ABA Receptor",100,29290610,XCorr,2.7900133,1.0000000,,,,0.0052479999139905,
NKSEEEEVNNEDHK,ph,S,308,true,"Tissue atlas Arabidopsis - ProteomicsDB",114,32188942,"MaxQuant score",140.9500000,1.0000000,,,,1.3053299880994E-6,
ENVPKGSEDGIEK,ph,S,393,true,"atm and atr DNA damage response",88,25561503,"MASCOT Score",24.0000000,1.0000000,,,,,0.7700000
ENVPKGSEDGIEK,ph,S,393,true,"Tissue atlas Arabidopsis - ProteomicsDB",114,32188942,"MaxQuant score",103.7700000,1.0000000,,,,0.00034406699705869,
