Peptide,PTM,ModifiedAA,ModifiedPosition,PeptideUniqueToGene,ExperimentDesc,ExpID,PubmedID,ScoreType,IdentScore,LocProb,Log2FChange,PQ-val,QuantSig,PEP,MassErrorPPM
AAQDDGGSGTPVK,ph,T,48,true,"atm and atr DNA damage response",88,25561503,"MASCOT Score",59.0000000,0.9440000,,,,,-0.8400000
TPVLLSFSPENLPIDHHQLQK,ph,S,65,true,"TOR Kinase and ABA Receptor",100,29290610,XCorr,3.5069013,0.8992000,,,,0.0002913000062108,
LAATLWEINDDADPPVNSDK,ph,S,103,true,"TOR Kinase and ABA Receptor",100,29290610,XCorr,3.9780064,1.0000000,,,,0.00010489999840502,
FKNVSDGLTTSK,ph,S,183,true,"srk2dei ABA signaling phopshoproteomics",83,23572148,"MASCOT Score",22.0000000,,,,,,0.0048000
FKNVSDGLTTSK,ph,T,187,true,"srk2dei ABA signaling phopshoproteomics",83,23572148,"MASCOT Score",22.0000000,,,,,,0.0048000
FKNVSDGLTTSK,ph,T,188,true,"srk2dei ABA signaling phopshoproteomics",83,23572148,"MASCOT Score",22.0000000,,,,,,0.0048000
FKNVSDGLTTSK,ph,S,189,true,"srk2dei ABA signaling phopshoproteomics",83,23572148,"MASCOT Score",22.0000000,,,,,,0.0048000
WGYVDSLKDR,ph,S,412,true,"Tissue atlas Arabidopsis - ProteomicsDB",114,32188942,"MaxQuant score",42.5680000,0.9994040,,,,0.018577599897981,
RFDGSGGDDDDDDPVEKR,ph,S,422,true,"Tissue atlas Arabidopsis - ProteomicsDB",114,32188942,"MaxQuant score",127.2000000,1.0000000,,,,1.784289938226E-15,
RFDGSGGDDDDDDPVEK,ph,S,422,true,"atm and atr DNA damage response",88,25561503,"MASCOT Score",41.0000000,1.0000000,,,,,-1.0700000
RFDGSGGDDDDDDPVEK,ph,S,422,true,"TOR Kinase and ABA Receptor",100,29290610,XCorr,5.4313469,1.0000000,,,,1.7719999911847E-9,
SVIVENGERDESLK,ph,S,436,true,"atm and atr DNA damage response",88,25561503,"MASCOT Score",27.0000000,1.0000000,,,,,-1.0400000
SVIVENGERDESLK,ph,S,436,true,"Tissue atlas Arabidopsis - ProteomicsDB",114,32188942,"MaxQuant score",91.6570000,1.0000000,,,,0.00040172299486585,
