Peptide,PTM,ModifiedAA,ModifiedPosition,PeptideUniqueToGene,ExperimentDesc,ExpID,PubmedID,ScoreType,IdentScore,LocProb,Log2FChange,PQ-val,QuantSig,PEP,MassErrorPPM
MENTRPNEEEGR,nta,M,1,true,"Arg/N-end rule pathway Roots",80,25728785,"MASCOT Score",37.7200000,,,,,0.0014029999729246,
MENTRPNEEEGR,nta,M,1,true,"Arg/N-end rule seed, prt6 vs. Wt",99,29168982,"MASCOT Score",34.8700000,,,,,0.018500000238419,-2.3454647
MENTRPNEEEGRISEPNWSER,ph,S,14,true,"Tissue atlas Arabidopsis - ProteomicsDB",114,32188942,"MaxQuant score",53.8950000,0.9910560,,,,0.00027995501295663,
ALDCDLASSR,ox,C,101,true,"OxiTRAQ Arabidopsis - 5 mM H2O2 versus control",47,24376095,,,,-0.2527875,0.2082178,NO,,
ALDCDLASSR,sno,C,101,true,"hot5-4 / wildtype, FAT-switch S-nitrosoproteome",169,37277371,,,,0.3153070,0.0736519,NO,,
ALDCDLASSR,ph,S,105,true,"Tissue atlas Arabidopsis - ProteomicsDB",114,32188942,"MaxQuant score",193.6200000,0.9320490,,,,1.168860066245E-13,
SSGNVENQSVASSGLK,ph,S,108,true,"atm and atr DNA damage response",88,25561503,"MASCOT Score",117.0000000,0.9970000,,,,,1.4600000
SSGNVENQSVASSGLK,ph,S,120,true,"Tissue atlas Arabidopsis - ProteomicsDB",114,32188942,"MaxQuant score",146.7600000,0.8480960,,,,6.0147198333027E-10,
VSSSNSAAHDSSDDDWEALADVEPSK,ph,S,143,true,"Large-scale phosphorylation discovery",44,23111157,XCorr,4.8560000,,,,,,
VSSSNSAAHDSSDDDWEALADVEPSK,ph,S,143,true,"Lateral root-induction - NAA vs control",106,23328941,"MASCOT Score",34.0000000,,,,,,
VSSSNSAAHDSSDDDWEALADVEPSK,ph,S,144,true,"srk2dei ABA signaling phopshoproteomics",83,23572148,"MASCOT Score",29.0000000,,,,,,0.0002000
VSSSNSAAHDSSDDDWEALADVEPSK,ph,S,144,true,"Lateral root-induction - NAA vs control",106,23328941,"MASCOT Score",34.0000000,,,,,,
VSSSNSAAHDSSDDDWEALADVEPSK,ph,S,145,true,"srk2dei ABA signaling phopshoproteomics",83,23572148,"MASCOT Score",39.0000000,,,,,,0.0037000
VSSSNSAAHDSSDDDWEALADVEPSK,ph,S,145,true,"Lateral root-induction - NAA vs control",106,23328941,"MASCOT Score",42.0000000,,,,,,
VSSSNSAAHDSSDDDWEALADVEPSK,ph,S,147,true,"srk2dei ABA signaling phopshoproteomics",83,23572148,"MASCOT Score",61.0000000,,,,,,-0.0008000
VSSSNSAAHDSSDDDWEALADVEPSK,ph,S,147,true,"TOR Kinase and ABA Receptor",100,29290610,XCorr,5.1810784,0.7544000,,,,1.063000013346E-6,
VSSSNSAAHDSSDDDWEALADVEPSK,ph,S,152,true,"Large-scale phosphorylation discovery",44,23111157,XCorr,4.8560000,,,,,,
VSSSNSAAHDSSDDDWEALADVEPSK,ph,S,152,true,"PAMP-triggered phosphorylation",48,24601666,"MASCOT Score",22.2400000,,,,,,
VSSSNSAAHDSSDDDWEALADVEPSK,ph,S,152,true,"srk2dei ABA signaling phopshoproteomics",83,23572148,"MASCOT Score",56.0000000,,,,,,-0.0003000
VSSSNSAAHDSSDDDWEALADVEPSK,ph,S,152,true,"SnRK2 protein kinase substrates",85,23776212,XCorr,4.2988653,0.9490000,,,,6.0132701946713E-6,
VSSSNSAAHDSSDDDWEALADVEPSK,ph,S,152,true,"Lateral root-induction - NAA vs control",106,23328941,"MASCOT Score",42.0000000,,,,,,
VSSSNSAAHDSSDDDWEALADVEPSK,ph,S,153,true,"PAMP-triggered phosphorylation",48,24601666,"MASCOT Score",22.2400000,,,,,,
VSSSNSAAHDSSDDDWEALADVEPSK,ph,S,153,true,"srk2dei ABA signaling phopshoproteomics",83,23572148,"MASCOT Score",56.0000000,,,,,,-0.0003000
VSSSNSAAHDSSDDDWEALADVEPSK,ph,S,153,true,"LAXIC - ABA stress",84a,23660473,XCorr,4.9500000,0.7840000,,,,0.0051645399071276,
VSSSNSAAHDSSDDDWEALADVEPSK,ph,S,153,true,"Lateral root-induction - NAA vs control",106,23328941,"MASCOT Score",36.0000000,,,,,,
VSSSNSAAHDSSDDDWEALADVEPSK,ph,S,153,true,"Col-0 callus - FC Col-0 vs. Col-0 Xray",111a,31410901,,32.8700000,,1.7785082,0.0000000,NO,,1.0063951
VSSSNSAAHDSSDDDWEALADVEPSK,ph,S,153,true,"Col-0 X-ray callus - FC Col-0 vs. Col-0 Xray",111b,31410901,,32.8700000,,1.7785082,0.0000000,NO,,1.0063951
VSSSNSAAHDSSDDDWEALADVEPSK,ph,S,153,true,"atm callus - FC atm vs. atm Xray",111c,31410901,,32.8700000,,2.6153870,0.0000000,NO,,1.0063951
VSSSNSAAHDSSDDDWEALADVEPSK,ph,S,153,true,"atm-3 X-ray callus - FC atm vs. atm Xray",111d,31410901,,32.8700000,,2.6153870,0.0000000,NO,,1.0063951
GRGTFTYK,me1,R,195,true,"Arabidopsis protein methylome",123,31809900,"MaxQuant Score",70.4390000,1.0000000,,,,0.00078645499888808,-1.6386000
DFSESRFDDDSEDNDLSR,ph,S,212,true,"Tissue atlas Arabidopsis - ProteomicsDB",114,32188942,"MaxQuant score",100.2800000,0.9515360,,,,3.4808599593816E-6,
FDDDSEDNDLSR,ph,S,220,true,"STN8 phosphoproteome",38,21768351,"MASCOT Score",95.9900000,,,,,,-1.4261500
FDDDSEDNDLSR,ph,S,220,true,"Tyrosine phosphorylation in Arabidopsis",59,18463617,"MASCOT Score",91.0000000,,,,,,-0.5974057
FDDDSEDNDLSR,ph,S,220,true,"LAXIC - ABA stress",84a,23660473,XCorr,3.9400000,1.0000000,,,,2.2800000806456E-5,
FDDDSEDNDLSR,ph,S,220,true,"atm and atr DNA damage response",88,25561503,"MASCOT Score",70.0000000,1.0000000,,,,,0.0000000
FDDDSEDNDLSR,ph,S,220,true,"Phospho cell culture sucrose/TOR",109,30833711,,,0.9999600,,,,,
FDDDSEDNDLSR,ph,S,220,true,"Tissue atlas Arabidopsis - ProteomicsDB",114,32188942,"MaxQuant score",290.1000000,1.0000000,,,,0,
DFSESRFDDDSEDNDLSR,ph,S,226,true,"Tyrosine phosphorylation in Arabidopsis",59,18463617,"MASCOT Score",22.0000000,,,,,,-0.8528532
TPSAALEACK,so,C,296,true,"Arabidopsis S-sulfenylation chemoproteomics",108,31578252,"pFind PSM Score",0.0143547,,1.2500000,,,,-0.7514266
HVQCSFTIR,so,C,301,true,"Arabidopsis S-sulfenylation chemoproteomics",108,31578252,"pFind PSM Score",0.0252358,,1.3513500,,,,-1.0141344
DLEPPSQRPK,ph,S,327,true,"Tissue atlas Arabidopsis - ProteomicsDB",114,32188942,"MaxQuant score",72.2900000,1.0000000,,,,0.0088980197906494,
