Peptide,PTM,ModifiedAA,ModifiedPosition,PeptideUniqueToGene,ExperimentDesc,ExpID,PubmedID,ScoreType,IdentScore,LocProb,Log2FChange,PQ-val,QuantSig,PEP,MassErrorPPM
FYEILGVPKTAAPEDLKK,ac,K,23,true,"Quantitative Acetylproteomics",101,29440448,,,,,,,,
ELAQAYEVLSDPEKR,ac,K,67,false,"Quantitative Acetylproteomics",101,29440448,,,,,,,,
EIYDQYGEDALK,ph,Y,71,false,"SIRK1 exp - sirk1 mutant vs WT",86b,23820729,,,,-0.6595320,,NO,,
EIYDQYGEDALK,ph,Y,71,false,"SIRK1 exp - 35S:SIRK1 vs WT",86c,23820729,,,,-0.9222916,,NO,,
CGGCQGSGMK,so,C,165,false,"S-sulfenylation site detection using YAP1C",110,32714340,,,,,,,,
ITFSGQADEAPDTVTGDIVFVIQQK,nta,I,237,true,"Characterization plant N-terminal acetylation",6,22223895,"MASCOT Score",95.3400000,,,,,,
AIEAVLPKPTK,ph,T,363,true,"Tissue atlas Arabidopsis - ProteomicsDB",114,32188942,"MaxQuant score",91.3070000,1.0000000,,,,0.0017813800368458,
EAYDDDEEDHPGGAQR,nt,E,398,true,"Arabidopsis translation initiation landscape - NT",167b,35069635,,,,,,,,
