Peptide,PTM,ModifiedAA,ModifiedPosition,PeptideUniqueToGene,ExperimentDesc,ExpID,PubmedID,ScoreType,IdentScore,LocProb,Log2FChange,PQ-val,QuantSig,PEP,MassErrorPPM
HPTLGDFELQHLPVGVDNAEIEER,ph,T,112,true,"Tissue atlas Arabidopsis - ProteomicsDB",114,32188942,"MaxQuant score",95.7460000,1.0000000,,,,5.3745198709307E-16,
QVSPSASDSNSRPLNQSSPSEQDR,ph,S,228,true,"STN8 phosphoproteome",38,21768351,"MASCOT Score",54.3600000,,,,,,-1.7015600
QVSPSASDSNSRPLNQSSPSEQDR,ph,S,228,true,"srk2dei ABA signaling phopshoproteomics",83,23572148,"MASCOT Score",76.0000000,,,,,,-0.0007000
QVSPSASDSNSRPLNQSSPSEQDR,ph,S,228,true,"TOR Kinase and ABA Receptor",100,29290610,XCorr,3.8428125,0.9692000,,,,4.8160000432063E-8,
QVSPSASDSNSRPLNQSSPSEQDR,ph,S,228,true,"Lateral root-induction - NAA vs control",106,23328941,"MASCOT Score",35.0000000,,,,,,
QVSPSASDSNSRPLNQSSPSEQDR,ph,S,228,true,"Col-0 callus - FC Col-0 vs. Col-0 Xray",111a,31410901,,52.7700000,,0.0369740,0.0000000,NO,,1.1941879
QVSPSASDSNSRPLNQSSPSEQDR,ph,S,228,true,"Col-0 X-ray callus - FC Col-0 vs. Col-0 Xray",111b,31410901,,52.7700000,,0.0369740,0.0000000,NO,,1.1941879
QVSPSASDSNSRPLNQSSPSEQDR,ph,S,228,true,"atm callus - FC atm vs. atm Xray",111c,31410901,,52.7700000,,0.0231551,0.0000000,NO,,1.1941879
QVSPSASDSNSRPLNQSSPSEQDR,ph,S,228,true,"atm-3 X-ray callus - FC atm vs. atm Xray",111d,31410901,,52.7700000,,0.0231551,0.0000000,NO,,1.1941879
QVSPSASDSNSRPLNQSSPSEQDR,ph,S,228,true,"Tissue atlas Arabidopsis - ProteomicsDB",114,32188942,"MaxQuant score",174.8600000,0.9999990,,,,0,
QVSPSASDSNSR,ph,S,228,true,"atm and atr DNA damage response",88,25561503,"MASCOT Score",64.0000000,1.0000000,,,,,-0.2200000
QVSPSASDSNSRPLNQSSPSEQDR,ph,S,230,true,"Tissue atlas Arabidopsis - ProteomicsDB",114,32188942,"MaxQuant score",135.1000000,0.9559220,,,,7.273139985057E-35,
QVSPSASDSNSRPLNQSSPSEQDR,ph,S,242,true,"Lateral root-induction - NAA vs control",106,23328941,"MASCOT Score",34.0000000,,,,,,
QVSPSASDSNSRPLNQSSPSEQDR,ph,S,243,true,"Col-0 callus - FC Col-0 vs. Col-0 Xray",111a,31410901,,21.6300000,,-0.6368386,0.0000000,NO,,0.9826095
QVSPSASDSNSRPLNQSSPSEQDR,ph,S,243,true,"Col-0 X-ray callus - FC Col-0 vs. Col-0 Xray",111b,31410901,,21.6300000,,-0.6368386,0.0000000,NO,,0.9826095
QVSPSASDSNSRPLNQSSPSEQDR,ph,S,243,true,"atm callus - FC atm vs. atm Xray",111c,31410901,,21.6300000,,-0.1293008,0.0000000,NO,,0.9826095
QVSPSASDSNSRPLNQSSPSEQDR,ph,S,243,true,"atm-3 X-ray callus - FC atm vs. atm Xray",111d,31410901,,21.6300000,,-0.1293008,0.0000000,NO,,0.9826095
PLNQSSPSEQDR,ph,S,243,true,"Tissue atlas Arabidopsis - ProteomicsDB",114,32188942,"MaxQuant score",195.3800000,0.9895840,,,,0,
AGPSELQSFSESLK,ph,S,257,true,"Tissue atlas Arabidopsis - ProteomicsDB",114,32188942,"MaxQuant score",213.5100000,0.9060040,,,,0,
AGPSELQSFSESLK,ph,S,261,true,"Tissue atlas Arabidopsis - ProteomicsDB",114,32188942,"MaxQuant score",269.8700000,0.9411420,,,,0,
YKESISKNTR,ub,K,279,true,"Arabidopsis ubiquitination COFRADIC",40,26744219,"MaxQuant Score",45.4330000,1.0000000,,,,0.016000000759959,1.1250000
NTSMADLGSEVKR,ph,S,294,true,"Protein sumoylation and phosphorylation cross-talk",97,28419593,,,,,,,,
NTSMADLGSEVKR,ph,S,294,true,"Tissue atlas Arabidopsis - ProteomicsDB",114,32188942,"MaxQuant score",186.6900000,0.9999920,,,,2.2013000739301E-22,
NTSMADLGSEVK,ph,S,294,true,"Large-scale phosphorylation discovery",44,23111157,XCorr,4.2750000,,,,,,
NTSMADLGSEVK,ph,S,294,true,"atm and atr DNA damage response",88,25561503,"MASCOT Score",71.0000000,0.9980000,,,,,-0.3900000
NTSMADLGSEVK,ph,S,294,true,"TOR Kinase and ABA Receptor",100,29290610,XCorr,3.7514548,0.9026000,,,,2.1789999209432E-6,
NTSMADLGSEVKR,ub,K,303,true,"Arabidopsis ubiquitination COFRADIC",40,26744219,"MaxQuant Score",83.6920000,1.0000000,,,,6.4829997427296E-5,-0.1090000
EVSAGIATVSR,ph,S,307,true,"Tissue atlas Arabidopsis - ProteomicsDB",114,32188942,"MaxQuant score",83.5730000,0.9999960,,,,0.00080031802644953,
LETRENSRPSTASVSDVSENHTPETNNEHNR,ph,T,322,true,"TOR Kinase and ABA Receptor",100,29290610,XCorr,4.3180504,0.9710000,,,,0.0057439999654889,
LETRENSRPSTASVSDVSENHTPETNNEHNR,ph,T,322,true,"Tissue atlas Arabidopsis - ProteomicsDB",114,32188942,"MaxQuant score",153.6000000,0.7974320,,,,0,
ENSRPSTASVSDVSENHTPETNNEHNR,ph,S,329,true,"Tissue atlas Arabidopsis - ProteomicsDB",114,32188942,"MaxQuant score",243.9200000,0.8834080,,,,0,
ENSRPSTASVSDVSENHTPETNNEHNR,ph,T,330,true,"TOR Kinase and ABA Receptor",100,29290610,XCorr,3.2317009,0.8451000,,,,8.355000025162E-10,
ENSRPSTASVSDVSENHTPETNNEHNR,ph,S,332,true,"Tissue atlas Arabidopsis - ProteomicsDB",114,32188942,"MaxQuant score",110.9000000,0.9773700,,,,5.1089601043122E-28,
AAAGDEHSVNER,ph,S,358,true,"Tissue atlas Arabidopsis - ProteomicsDB",114,32188942,"MaxQuant score",99.1610000,1.0000000,,,,0.00013863299682271,
