Peptide,PTM,ModifiedAA,ModifiedPosition,PeptideUniqueToGene,ExperimentDesc,ExpID,PubmedID,ScoreType,IdentScore,LocProb,Log2FChange,PQ-val,QuantSig,PEP,MassErrorPPM
MMAETEGSVADDRELITR,nta,M,1,true,"Arabidopsis translation initiation landscape - NTA",167a,35069635,,,,,,,,
MMAETEGSVADDR,nta,M,1,true,"Characterization plant N-terminal acetylation",6,22223895,"MASCOT Score",46.6100000,,,,,,
MMAETEGSVADDR,nta,M,1,true,"FtsH12 N-terminome: WT / FtsH12 knockdown miRNA",118,33216923,"MaxQuant score",112.1700000,,,,,4.2799998482224E-5,
AETEGSVADDR,nt,A,3,true,"Arg/N-end rule seed, prt6 vs. Wt",99,29168982,"MASCOT Score",40.2500000,,,,,0.041379999369383,3.3056369
AETEGSVADDRELITR,nta,A,3,true,"Arg/N-end rule pathway Roots",80,25728785,"MASCOT Score",55.4900000,,,,,0.00961699988693,
AETEGSVADDR,nta,A,3,true,"Arg/N-end rule seed, prt6 vs. Wt",99,29168982,"MASCOT Score",40.2500000,,,,,0.041379999369383,3.3056369
MMAETEGSVADDRELITR,ph,S,8,true,"atm and atr DNA damage response",88,25561503,"MASCOT Score",24.0000000,0.9990000,,,,,-0.2600000
EGGIGTKSPWK,ph,T,24,true,"Tissue atlas Arabidopsis - ProteomicsDB",114,32188942,"MaxQuant score",92.7920000,0.8015690,,,,0.00132839998696,
EGGIGTKSPWK,ph,S,26,true,"Tissue atlas Arabidopsis - ProteomicsDB",114,32188942,"MaxQuant score",243.4900000,0.9997870,,,,0,
FAPYPVNQGPPILSPEK,ph,S,272,true,"TOR Kinase and ABA Receptor",100,29290610,XCorr,3.9752190,1.0000000,,,,0.00010150000161957,
FAPYPVNQGPPILSPEK,ph,S,272,true,"Tissue atlas Arabidopsis - ProteomicsDB",114,32188942,"MaxQuant score",176.4400000,1.0000000,,,,6.6185499367803E-23,
STSAETIGDGDKDSPK,ph,S,365,true,"Conserved plant phosphoproteome - Arabidopsis",61a,20466843,"MASCOT Score",58.0000000,1.0000000,,,,,
STSAETIGDGDKDSPK,ph,S,367,true,"Tissue atlas Arabidopsis - ProteomicsDB",114,32188942,"MaxQuant score",269.7200000,0.9999840,,,,0,
STSAETIGDGDKDSPK,ph,T,370,true,"Tyrosine phosphorylation in Arabidopsis",59,18463617,"MASCOT Score",46.0000000,,,,,,-0.9485996
STSAETIGDGDKDSPK,ph,T,370,true,"TOR Kinase and ABA Receptor",100,29290610,XCorr,4.8209925,0.9985000,,,,1.43899997056E-5,
STSAETIGDGDKDSPK,ph,T,370,true,"Tissue atlas Arabidopsis - ProteomicsDB",114,32188942,"MaxQuant score",160.0200000,1.0000000,,,,1.8174199919862E-34,
STSAETIGDGDKDSPKSITSGDNFGNPSK,ph,S,378,true,"srk2dei ABA signaling phopshoproteomics",83,23572148,"MASCOT Score",56.0000000,,,,,,-0.0013000
STSAETIGDGDKDSPKSITSGDNFGNPSK,ph,S,378,true,"SnRK2 protein kinase substrates",85,23776212,XCorr,3.4999311,0.9910000,,,,6.8217603256926E-5,
STSAETIGDGDKDSPKSITSGDNFGNPSK,ph,S,378,true,"Brassinosteroid-Regulated Phosphorylation Dynamics",94,26187819,"MaxQuant Score",62.5820000,0.9560000,,,,0.012000000104308,2.4170000
KSTSAETIGDGDKDSPK,ph,S,378,true,"STN8 phosphoproteome",38,21768351,"MASCOT Score",71.2500000,,,,,,-0.0340593
KSTSAETIGDGDKDSPK,ph,S,378,true,"Chloroplast kinase substrates",60,19376835,"MASCOT Score",63.7700000,,,,,,-0.0175560
KSTSAETIGDGDKDSPK,ph,S,378,true,"SnRK2 protein kinase substrates",85,23776212,XCorr,2.0597699,1.0000000,,,,0.0012011500075459,
STSAETIGDGDKDSPK,ph,S,378,true,"STN8 phosphoproteome",38,21768351,"MASCOT Score",88.7100000,,,,,,-1.2739800
STSAETIGDGDKDSPK,ph,S,378,true,"Large-scale phosphorylation discovery",44,23111157,XCorr,4.4040000,,,,,,
STSAETIGDGDKDSPK,ph,S,378,true,"Tyrosine phosphorylation in Arabidopsis",59,18463617,"MASCOT Score",58.0000000,,,,,,-0.6521620
STSAETIGDGDKDSPK,ph,S,378,true,"Chloroplast kinase substrates",60,19376835,"MASCOT Score",86.4000000,,,,,,-0.7291840
STSAETIGDGDKDSPK,ph,S,378,true,"Conserved plant phosphoproteome - Arabidopsis",61a,20466843,"MASCOT Score",46.0000000,1.0000000,,,,,
STSAETIGDGDKDSPK,ph,S,378,true,"srk2dei ABA signaling phopshoproteomics",83,23572148,"MASCOT Score",21.0000000,,,,,,0.0001000
STSAETIGDGDKDSPK,ph,S,378,true,"LAXIC - ABA stress",84a,23660473,XCorr,3.0400000,1.0000000,,,,0.00022910900588613,
STSAETIGDGDKDSPK,ph,S,378,true,"LAXIC - mannitol vs control",84b,23660473,XCorr,3.3500000,0.9970000,,,,1.399999973728E-6,
STSAETIGDGDKDSPK,ph,S,378,true,"SnRK2 protein kinase substrates",85,23776212,XCorr,3.6281440,1.0000000,,,,1.2367800117374E-8,
STSAETIGDGDKDSPK,ph,S,378,true,"Protein sumoylation and phosphorylation cross-talk",97,28419593,,,,,,,,
STSAETIGDGDKDSPK,ph,S,378,true,"TOR Kinase and ABA Receptor",100,29290610,XCorr,5.2571754,1.0000000,,,,3.7190000057308E-7,
STSAETIGDGDKDSPK,ph,S,378,true,"Phospho cell culture sucrose/TOR",109,30833711,,,1.0000000,,,,,
STSAETIGDGDKDSPK,ph,S,378,true,"Col-0 callus - FC Col-0 vs. Col-0 Xray",111a,31410901,,59.0100000,,0.4749766,0.0000000,NO,,0.3326284
STSAETIGDGDKDSPK,ph,S,378,true,"Col-0 X-ray callus - FC Col-0 vs. Col-0 Xray",111b,31410901,,59.0100000,,0.4749766,0.0000000,NO,,0.3326284
STSAETIGDGDKDSPK,ph,S,378,true,"atm callus - FC atm vs. atm Xray",111c,31410901,,59.0100000,,2.2459897,0.0000000,NO,,0.3326284
STSAETIGDGDKDSPK,ph,S,378,true,"atm-3 X-ray callus - FC atm vs. atm Xray",111d,31410901,,59.0100000,,2.2459897,0.0000000,NO,,0.3326284
STSAETIGDGDKDSPK,ph,S,378,true,"Tissue atlas Arabidopsis - ProteomicsDB",114,32188942,"MaxQuant score",337.4500000,1.0000000,,,,0,
STSAETIGDGDKDSPKSITSGDNFGNPSK,ph,S,381,true,"srk2dei ABA signaling phopshoproteomics",83,23572148,"MASCOT Score",56.0000000,,,,,,-0.0013000
STSAETIGDGDKDSPKSITSGDNFGNPSK,ph,S,381,true,"SnRK2 protein kinase substrates",85,23776212,XCorr,3.4999311,0.9770000,,,,6.8217603256926E-5,
STSAETIGDGDKDSPKSITSGDNFGNPSK,ph,S,381,true,"Phospho cell culture sucrose/TOR",109,30833711,,,0.9885680,,,,,
SITSGDNFGNPSK,ph,S,381,true,"STN8 phosphoproteome",38,21768351,"MASCOT Score",49.6200000,,,,,,-0.6396040
SITSGDNFGNPSK,ph,S,381,true,"Tyrosine phosphorylation in Arabidopsis",59,18463617,"MASCOT Score",53.0000000,,,,,,-0.6416766
SITSGDNFGNPSK,ph,S,381,true,"Chloroplast kinase substrates",60,19376835,"MASCOT Score",43.5600000,,,,,,-0.5399310
SITSGDNFGNPSK,ph,S,381,true,"srk2dei ABA signaling phopshoproteomics",83,23572148,"MASCOT Score",77.0000000,,,,,,-0.0006000
SITSGDNFGNPSK,ph,S,381,true,"atm and atr DNA damage response",88,25561503,"MASCOT Score",88.0000000,0.9960000,,,,,-0.1700000
SITSGDNFGNPSK,ph,S,381,true,"TOR Kinase and ABA Receptor",100,29290610,XCorr,3.9110682,0.9996000,,,,1.6859999959706E-5,
SITSGDNFGNPSK,ph,S,381,true,"Col-0 callus - FC Col-0 vs. Col-0 Xray",111a,31410901,,62.5900000,,0.8890638,0.0000000,NO,,0.6851785
SITSGDNFGNPSK,ph,S,381,true,"Col-0 X-ray callus - FC Col-0 vs. Col-0 Xray",111b,31410901,,62.5900000,,0.8890638,0.0000000,NO,,0.6851785
SITSGDNFGNPSK,ph,S,381,true,"atm callus - FC atm vs. atm Xray",111c,31410901,,62.5900000,,0.1027162,0.0000000,NO,,0.6851785
SITSGDNFGNPSK,ph,S,381,true,"atm-3 X-ray callus - FC atm vs. atm Xray",111d,31410901,,62.5900000,,0.1027162,0.0000000,NO,,0.6851785
SITSGDNFGNPSK,ph,S,381,true,"Tissue atlas Arabidopsis - ProteomicsDB",114,32188942,"MaxQuant score",297.9100000,0.9999720,,,,0,
STSAETIGDGDKDSPKSITSGDNFGNPSK,ph,T,383,true,"TOR Kinase and ABA Receptor",100,29290610,XCorr,4.7026730,0.8345000,,,,0.0010720000136644,
SITSGDNFGNPSK,ph,T,383,true,"srk2dei ABA signaling phopshoproteomics",83,23572148,"MASCOT Score",62.0000000,,,,,,0.0005000
SITSGDNFGNPSK,ph,T,383,true,"Tissue atlas Arabidopsis - ProteomicsDB",114,32188942,"MaxQuant score",266.7500000,0.9823580,,,,0,
STSAETIGDGDKDSPKSITSGDNFGNPSK,ph,S,384,true,"SnRK2 protein kinase substrates",85,23776212,XCorr,3.0301435,0.7940000,,,,0.015601400285959,
STSAETIGDGDKDSPKSITSGDNFGNPSK,ph,S,384,true,"TOR Kinase and ABA Receptor",100,29290610,XCorr,4.7026730,0.8345000,,,,0.0010720000136644,
SITSGDNFGNPSK,ph,S,384,true,"Tyrosine phosphorylation in Arabidopsis",59,18463617,"MASCOT Score",57.0000000,,,,,,-0.8555691
SITSGDNFGNPSK,ph,S,384,true,"srk2dei ABA signaling phopshoproteomics",83,23572148,"MASCOT Score",52.0000000,,,,,,0.0007000
SITSGDNFGNPSK,ph,S,384,true,"LAXIC - ABA stress",84a,23660473,XCorr,3.0400000,0.9980000,,,,1.5100000382517E-5,
SITSGDNFGNPSK,ph,S,384,true,"SnRK2 protein kinase substrates",85,23776212,XCorr,2.0003884,0.9940000,,,,0.00023646900081076,
SITSGDNFGNPSK,ph,S,384,true,"TOR Kinase and ABA Receptor",100,29290610,XCorr,3.3304927,0.9730000,,,,0.0061380001716316,
SITSGDNFGNPSK,ph,S,384,true,"Phospho cell culture sucrose/TOR",109,30833711,,,0.8678040,,,,,
SITSGDNFGNPSK,ph,S,384,true,"Tissue atlas Arabidopsis - ProteomicsDB",114,32188942,"MaxQuant score",163.6400000,0.9992290,,,,1.3014900268615E-10,
GSSKPTVSDFSSEGAQSSR,ph,S,396,true,"atm and atr DNA damage response",88,25561503,"MASCOT Score",30.0000000,0.9940000,,,,,-0.1700000
GSSKPTVSDFSSEGAQSSR,ph,S,401,true,"Tissue atlas Arabidopsis - ProteomicsDB",114,32188942,"MaxQuant score",106.1100000,0.9277450,,,,1.487569978309E-8,
GSSKPTVSDFSSEGAQSSR,ph,S,404,true,"Tissue atlas Arabidopsis - ProteomicsDB",114,32188942,"MaxQuant score",112.6400000,0.9209190,,,,5.5941301591034E-10,
GSSKPTVSDFSSEGAQSSR,ph,S,410,true,"Tissue atlas Arabidopsis - ProteomicsDB",114,32188942,"MaxQuant score",134.2800000,0.8327060,,,,6.2526498328984E-15,
NVEDLSNDFSNTFLLDEELDLEHRSPR,ph,S,439,true,"SnRK2 protein kinase substrates",85,23776212,XCorr,3.3430450,0.7600000,,,,4.0200000512414E-5,
RNVEDLSNDFSNTFLLDEELDLEHRSPRK,ph,S,454,true,"Arabidopsis root NAA phosphoproteome",18a,27643528,"MaxQuant Score",87.6740000,1.0000000,,,,1.1599999849565E-9,0.0880000
NVEDLSNDFSNTFLLDEELDLEHRSPRK,ph,S,454,true,"Tissue atlas Arabidopsis - ProteomicsDB",114,32188942,"MaxQuant score",250.0300000,1.0000000,,,,0,
NVEDLSNDFSNTFLLDEELDLEHRSPR,ph,S,454,true,"Large-scale phosphorylation discovery",44,23111157,XCorr,6.0220000,,,,,,
NVEDLSNDFSNTFLLDEELDLEHRSPR,ph,S,454,true,"MAPK Arabidopsis substrates",45,23172892,"MaxQuant Score",139.4400000,,,,,,
KSGLSMSK,ph,S,461,true,"atm and atr DNA damage response",88,25561503,"MASCOT Score",26.0000000,0.9940000,,,,,-2.5400000
SIEYEDDDMAVDDQDIQK,ph,S,465,true,"Phosphoproteomic analysis of seed maturation",42,22440515,"MASCOT Score",115.0000000,,,,,,-0.6200000
SIEYEDDDMAVDDQDIQK,ph,S,465,true,"Tyrosine phosphorylation in Arabidopsis",59,18463617,"MASCOT Score",80.0000000,,,,,,-2.1740701
SIEYEDDDMAVDDQDIQK,ph,S,465,true,"srk2dei ABA signaling phopshoproteomics",83,23572148,"MASCOT Score",125.0000000,,,,,,-0.0025000
SIEYEDDDMAVDDQDIQK,ph,S,465,true,"LAXIC - mannitol vs control",84b,23660473,XCorr,6.0500000,0.9990000,1.9581730,,NO,3.8799999324546E-10,
SIEYEDDDMAVDDQDIQK,ph,S,465,true,"SnRK2 protein kinase substrates",85,23776212,XCorr,4.8255668,0.9980000,,,,0.00037118399632163,
SIEYEDDDMAVDDQDIQK,ph,S,465,true,"atm and atr DNA damage response",88,25561503,"MASCOT Score",60.0000000,0.9990000,,,,,0.1000000
SIEYEDDDMAVDDQDIQK,ph,S,465,true,"TOR Kinase and ABA Receptor",100,29290610,XCorr,5.8998184,0.9927000,,,,8.5519999970529E-9,
SIEYEDDDMAVDDQDIQK,ph,S,465,true,"Lateral root-induction - NAA vs control",106,23328941,"MASCOT Score",73.0000000,,,,,,
SIEYEDDDMAVDDQDIQK,ph,S,465,true,"Phospho cell culture sucrose/TOR",109,30833711,,,1.0000000,,,,,
SIEYEDDDMAVDDQDIQK,ph,S,465,true,"Tissue atlas Arabidopsis - ProteomicsDB",114,32188942,"MaxQuant score",315.6600000,1.0000000,,,,0,
LVIVTQNSGKSDGAGIGGTEAK,ph,T,487,true,"srk2dei ABA signaling phopshoproteomics",83,23572148,"MASCOT Score",26.0000000,,,,,,0.0019000
LVIVTQNSGKSDGAGIGGTEAK,ph,S,490,true,"LAXIC - mannitol vs control",84b,23660473,XCorr,4.7300000,1.0000000,SINGLETON_UP,0.0000000,YES,5.5899998172015E-12,
LVIVTQNSGKSDGAGIGGTEAK,ph,S,490,true,"Tissue atlas Arabidopsis - ProteomicsDB",114,32188942,"MaxQuant score",225.3400000,0.9999980,,,,0,
LVIVTQNSGK,ph,S,490,true,"srk2dei ABA signaling phopshoproteomics",83,23572148,"MASCOT Score",26.0000000,,,,,,-0.0005000
LVIVTQNSGKSDGAGIGGTEAK,ph,S,493,true,"srk2dei ABA signaling phopshoproteomics",83,23572148,"MASCOT Score",26.0000000,,,,,,0.0019000
LVIVTQNSGKSDGAGIGGTEAK,ph,S,493,true,"LAXIC - mannitol vs control",84b,23660473,XCorr,4.7300000,1.0000000,SINGLETON_UP,0.0000000,YES,5.5899998172015E-12,
LVIVTQNSGKSDGAGIGGTEAK,ph,S,493,true,"Tissue atlas Arabidopsis - ProteomicsDB",114,32188942,"MaxQuant score",225.3400000,1.0000000,,,,0,
IKSGEGLNTK,ph,S,548,true,"atm and atr DNA damage response",88,25561503,"MASCOT Score",47.0000000,1.0000000,,,,,-1.8500000
IKSGEGLNTK,ph,S,548,true,"Tissue atlas Arabidopsis - ProteomicsDB",114,32188942,"MaxQuant score",162.3200000,1.0000000,,,,9.1365200205473E-7,
LGENSAANDGGEEHGIITSR,ph,S,560,true,"Tissue atlas Arabidopsis - ProteomicsDB",114,32188942,"MaxQuant score",146.1500000,1.0000000,,,,1.0739799868788E-24,
RFFSSNIR,ph,S,595,true,"Tissue atlas Arabidopsis - ProteomicsDB",114,32188942,"MaxQuant score",68.8360000,0.8654070,,,,0.012727900408208,
NNGNISESPPSSSIGFFFGSTPPDSHGPR,ph,S,605,true,"Conserved plant phosphoproteome - Arabidopsis",61a,20466843,"MASCOT Score",81.0000000,1.0000000,,,,,
NNGNISESPPSSSIGFFFGSTPPDSHGPR,ph,S,605,true,"TOR Kinase and ABA Receptor",100,29290610,XCorr,4.1555891,0.8436000,,,,6.2979997892398E-5,
NNGNISESPPSSSIGFFFGSTPPDSHGPR,ph,S,607,true,"srk2dei ABA signaling phopshoproteomics",83,23572148,"MASCOT Score",38.0000000,,,,,,-0.0038000
NNGNISESPPSSSIGFFFGSTPPDSHGPR,ph,S,607,true,"Brassinosteroid-Regulated Phosphorylation Dynamics",94,26187819,"MaxQuant Score",112.7400000,0.7880000,,,,1.920999991023E-11,-0.7650000
NNGNISESPPSSSIGFFFGSTPPDSHGPR,ph,S,607,true,"TOR Kinase and ABA Receptor",100,29290610,XCorr,5.1002488,0.9682000,,,,6.4080001038747E-7,
NNGNISESPPSSSIGFFFGSTPPDSHGPR,ph,S,607,true,"Phospho cell culture sucrose/TOR",109,30833711,,,0.9907220,,,,,
NNGNISESPPSSSIGFFFGSTPPDSHGPR,ph,S,607,true,"Tissue atlas Arabidopsis - ProteomicsDB",114,32188942,"MaxQuant score",164.8000000,0.9905740,,,,0,
NNGNISESPPSSSIGFFFGSTPPDSHGPR,ph,S,612,true,"srk2dei ABA signaling phopshoproteomics",83,23572148,"MASCOT Score",79.0000000,,,,,,-0.0016000
NNGNISESPPSSSIGFFFGSTPPDSHGPR,ph,S,612,true,"Brassinosteroid-Regulated Phosphorylation Dynamics",94,26187819,"MaxQuant Score",127.1600000,0.8660000,,,,1.7260000292368E-17,0.7880000
NNGNISESPPSSSIGFFFGSTPPDSHGPR,ph,S,612,true,"Col-0 callus - FC Col-0 vs. Col-0 Xray",111a,31410901,,27.5100000,,0.5674155,0.0000000,NO,,1.8611575
NNGNISESPPSSSIGFFFGSTPPDSHGPR,ph,S,612,true,"Col-0 X-ray callus - FC Col-0 vs. Col-0 Xray",111b,31410901,,27.5100000,,0.5674155,0.0000000,NO,,1.8611575
NNGNISESPPSSSIGFFFGSTPPDSHGPR,ph,S,612,true,"atm callus - FC atm vs. atm Xray",111c,31410901,,27.5100000,,0.9534507,0.0000000,NO,,1.8611575
NNGNISESPPSSSIGFFFGSTPPDSHGPR,ph,S,612,true,"atm-3 X-ray callus - FC atm vs. atm Xray",111d,31410901,,27.5100000,,0.9534507,0.0000000,NO,,1.8611575
NNGNISESPPSSSIGFFFGSTPPDSHGPR,ph,S,619,true,"Col-0 callus - FC Col-0 vs. Col-0 Xray",111a,31410901,,34.3800000,,1.3477120,0.0344425,YES,,0.9974462
NNGNISESPPSSSIGFFFGSTPPDSHGPR,ph,S,619,true,"Col-0 X-ray callus - FC Col-0 vs. Col-0 Xray",111b,31410901,,34.3800000,,1.3477120,0.0344425,YES,,0.9974462
NNGNISESPPSSSIGFFFGSTPPDSHGPR,ph,S,619,true,"atm callus - FC atm vs. atm Xray",111c,31410901,,34.3800000,,1.1040625,0.0715024,NO,,0.9974462
NNGNISESPPSSSIGFFFGSTPPDSHGPR,ph,S,619,true,"atm-3 X-ray callus - FC atm vs. atm Xray",111d,31410901,,34.3800000,,1.1040625,0.0715024,NO,,0.9974462
NNGNISESPPSSSIGFFFGSTPPDSHGPR,ph,T,620,true,"Brassinosteroid-Regulated Phosphorylation Dynamics",94,26187819,"MaxQuant Score",127.1600000,0.9440000,,,,1.7260000292368E-17,-1.2480000
NNGNISESPPSSSIGFFFGSTPPDSHGPR,ph,T,620,true,"Tissue atlas Arabidopsis - ProteomicsDB",114,32188942,"MaxQuant score",239.7900000,0.8669100,,,,0,
LSSSPQCTLSGSSPPVGSLPK,ph,S,633,true,"Conserved plant phosphoproteome - Arabidopsis",61a,20466843,"MASCOT Score",42.0000000,1.0000000,,,,,
LSSSPQCTLSGSSPPVGSLPK,ph,S,633,true,"srk2dei ABA signaling phopshoproteomics",83,23572148,"MASCOT Score",58.0000000,,,,,,-0.0006000
LSSSPQCTLSGSSPPVGSLPK,ph,S,633,true,"Brassinosteroid-Regulated Phosphorylation Dynamics",94,26187819,"MaxQuant Score",130.8000000,0.8460000,,,,1.1309999763398E-6,1.3780000
LSSSPQCTLSGSSPPVGSLPK,ph,S,633,true,"Col-0 callus - FC Col-0 vs. Col-0 Xray",111a,31410901,,55.4400000,,-0.2220786,0.0000000,NO,,1.2937035
LSSSPQCTLSGSSPPVGSLPK,ph,S,633,true,"Col-0 X-ray callus - FC Col-0 vs. Col-0 Xray",111b,31410901,,55.4400000,,-0.2220786,0.0000000,NO,,1.2937035
LSSSPQCTLSGSSPPVGSLPK,ph,S,633,true,"atm callus - FC atm vs. atm Xray",111c,31410901,,55.4400000,,0.8567865,0.0000000,NO,,1.2937035
LSSSPQCTLSGSSPPVGSLPK,ph,S,633,true,"atm-3 X-ray callus - FC atm vs. atm Xray",111d,31410901,,55.4400000,,0.8567865,0.0000000,NO,,1.2937035
LSSSPQCTLSGSSPPVGSLPK,ph,S,634,true,"srk2dei ABA signaling phopshoproteomics",83,23572148,"MASCOT Score",30.0000000,,,,,,-0.0005000
LSSSPQCTLSGSSPPVGSLPK,ph,S,634,true,"Lateral root-induction - NAA vs control",106,23328941,"MASCOT Score",28.0000000,,,,,,
LSSSPQCTLSGSSPPVGSLPK,ph,S,634,true,"Tissue atlas Arabidopsis - ProteomicsDB",114,32188942,"MaxQuant score",294.5800000,0.8829920,,,,0,
LSSSPQCTLSGSSPPVGSLPK,ph,S,635,true,"Conserved plant phosphoproteome - Arabidopsis",61a,20466843,"MASCOT Score",44.0000000,1.0000000,,,,,
LSSSPQCTLSGSSPPVGSLPK,ph,S,635,true,"srk2dei ABA signaling phopshoproteomics",83,23572148,"MASCOT Score",30.0000000,,,,,,-0.0005000
LSSSPQCTLSGSSPPVGSLPK,ph,S,635,true,"LAXIC - mannitol vs control",84b,23660473,XCorr,4.3200000,0.8090000,1.4903551,,NO,1.3999999770586E-10,
LSSSPQCTLSGSSPPVGSLPK,ph,S,635,true,"atm and atr DNA damage response",88,25561503,"MASCOT Score",31.0000000,0.9350000,,,,,-0.0700000
LSSSPQCTLSGSSPPVGSLPK,ph,S,635,true,"Tissue atlas Arabidopsis - ProteomicsDB",114,32188942,"MaxQuant score",309.4300000,0.9887090,,,,0,
LSSSPQCTLSGSSPPVGSLPK,sno,C,638,true,"hot5-4 / wildtype, FAT-switch S-nitrosoproteome",169,37277371,,,,,,,,
LSSSPQCTLSGSSPPVGSLPK,so,C,638,true,"S-sulfenylation site detection using YAP1C",110,32714340,,,,,,,,
LSSSPQCTLSGSSPPVGSLPK,ph,T,639,true,"srk2dei ABA signaling phopshoproteomics",83,23572148,"MASCOT Score",28.0000000,,,,,,-0.0018000
LSSSPQCTLSGSSPPVGSLPK,ph,T,639,true,"Brassinosteroid-Regulated Phosphorylation Dynamics",94,26187819,"MaxQuant Score",127.1400000,0.7980000,,,,7.8460002939096E-9,0.8180000
LSSSPQCTLSGSSPPVGSLPK,ph,T,639,true,"Lateral root-induction - NAA vs control",106,23328941,"MASCOT Score",27.0000000,,,,,,
LSSSPQCTLSGSSPPVGSLPK,ph,T,639,true,"Tissue atlas Arabidopsis - ProteomicsDB",114,32188942,"MaxQuant score",293.7200000,0.8673670,,,,0,
LSSSPQCTLSGSSPPVGSLPK,ph,S,641,true,"srk2dei ABA signaling phopshoproteomics",83,23572148,"MASCOT Score",28.0000000,,,,,,-0.0018000
LSSSPQCTLSGSSPPVGSLPK,ph,S,641,true,"Brassinosteroid-Regulated Phosphorylation Dynamics",94,26187819,"MaxQuant Score",109.6100000,0.7660000,,,,1.972000063688E-5,1.7910000
LSSSPQCTLSGSSPPVGSLPK,ph,S,641,true,"Lateral root-induction - NAA vs control",106,23328941,"MASCOT Score",36.0000000,,,,,,
LSSSPQCTLSGSSPPVGSLPK,ph,S,643,true,"Large-scale phosphorylation discovery",44,23111157,XCorr,3.4210000,,,,,,
LSSSPQCTLSGSSPPVGSLPK,ph,S,643,true,"Brassinosteroid-Regulated Phosphorylation Dynamics",94,26187819,"MaxQuant Score",164.2000000,0.8080000,,,,6.4670000415722E-27,-4.7340000
LSSSPQCTLSGSSPPVGSLPK,ph,S,643,true,"Lateral root-induction - NAA vs control",106,23328941,"MASCOT Score",27.0000000,,,,,,
LSSSPQCTLSGSSPPVGSLPK,ph,S,643,true,"Tissue atlas Arabidopsis - ProteomicsDB",114,32188942,"MaxQuant score",362.2400000,0.9720970,,,,0,
LSSSPQCTLSGSSPPVGSLPK,ph,S,644,true,"Large-scale phosphorylation discovery",44,23111157,XCorr,4.8580000,,,,,,
LSSSPQCTLSGSSPPVGSLPK,ph,S,644,true,"Conserved plant phosphoproteome - Arabidopsis",61a,20466843,"MASCOT Score",36.0000000,1.0000000,,,,,
LSSSPQCTLSGSSPPVGSLPK,ph,S,644,true,"srk2dei ABA signaling phopshoproteomics",83,23572148,"MASCOT Score",58.0000000,,,,,,-0.0006000
LSSSPQCTLSGSSPPVGSLPK,ph,S,644,true,"SnRK2 protein kinase substrates",85,23776212,XCorr,3.6604261,0.9740000,,,,0.0042745000682771,
LSSSPQCTLSGSSPPVGSLPK,ph,S,644,true,"atm and atr DNA damage response",88,25561503,"MASCOT Score",31.0000000,0.9960000,,,,,-0.0700000
LSSSPQCTLSGSSPPVGSLPK,ph,S,644,true,"Brassinosteroid-Regulated Phosphorylation Dynamics",94,26187819,"MaxQuant Score",164.2000000,0.9870000,,,,0,0.4750000
LSSSPQCTLSGSSPPVGSLPK,ph,S,644,true,"TOR Kinase and ABA Receptor",100,29290610,XCorr,4.5897274,0.9954000,,,,3.1129999911172E-8,
LSSSPQCTLSGSSPPVGSLPK,ph,S,644,true,"Lateral root-induction - NAA vs control",106,23328941,"MASCOT Score",38.0000000,,,,,,
LSSSPQCTLSGSSPPVGSLPK,ph,S,644,true,"Phospho cell culture sucrose/TOR",109,30833711,,,0.9793710,,,,,
LSSSPQCTLSGSSPPVGSLPK,ph,S,644,true,"Col-0 callus - FC Col-0 vs. Col-0 Xray",111a,31410901,,86.0300000,,0.0725307,0.0000000,NO,,1.0078694
LSSSPQCTLSGSSPPVGSLPK,ph,S,644,true,"Col-0 X-ray callus - FC Col-0 vs. Col-0 Xray",111b,31410901,,86.0300000,,0.0725307,0.0000000,NO,,1.0078694
LSSSPQCTLSGSSPPVGSLPK,ph,S,644,true,"atm callus - FC atm vs. atm Xray",111c,31410901,,86.0300000,,0.5440269,0.0000000,NO,,1.0078694
LSSSPQCTLSGSSPPVGSLPK,ph,S,644,true,"atm-3 X-ray callus - FC atm vs. atm Xray",111d,31410901,,86.0300000,,0.5440269,0.0000000,NO,,1.0078694
LSSSPQCTLSGSSPPVGSLPK,ph,S,644,true,"Tissue atlas Arabidopsis - ProteomicsDB",114,32188942,"MaxQuant score",406.0200000,0.9972530,,,,0,
LSSSPQCTLSGSSPPVGSLPK,ph,S,649,true,"srk2dei ABA signaling phopshoproteomics",83,23572148,"MASCOT Score",58.0000000,,,,,,-0.0006000
LSSSPQCTLSGSSPPVGSLPK,ph,S,649,true,"LAXIC - mannitol vs control",84b,23660473,XCorr,4.6400000,1.0000000,1.4903551,,NO,4.1100001006711E-13,
LSSSPQCTLSGSSPPVGSLPK,ph,S,649,true,"SnRK2 protein kinase substrates",85,23776212,XCorr,3.6604261,1.0000000,,,,0.0042745000682771,
LSSSPQCTLSGSSPPVGSLPK,ph,S,649,true,"atm and atr DNA damage response",88,25561503,"MASCOT Score",31.0000000,1.0000000,,,,,-0.0700000
LSSSPQCTLSGSSPPVGSLPK,ph,S,649,true,"Brassinosteroid-Regulated Phosphorylation Dynamics",94,26187819,"MaxQuant Score",164.2000000,1.0000000,,,,0,2.8190000
LSSSPQCTLSGSSPPVGSLPK,ph,S,649,true,"TOR Kinase and ABA Receptor",100,29290610,XCorr,4.6466026,1.0000000,,,,3.8359999052773E-6,
LSSSPQCTLSGSSPPVGSLPK,ph,S,649,true,"Lateral root-induction - NAA vs control",106,23328941,"MASCOT Score",28.0000000,,,,,,
LSSSPQCTLSGSSPPVGSLPK,ph,S,649,true,"Phospho cell culture sucrose/TOR",109,30833711,,,0.9999990,,,,,
LSSSPQCTLSGSSPPVGSLPK,ph,S,649,true,"Col-0 callus - FC Col-0 vs. Col-0 Xray",111a,31410901,,64.3200000,,-0.1857606,0.0000000,NO,,1.0026364
LSSSPQCTLSGSSPPVGSLPK,ph,S,649,true,"Col-0 X-ray callus - FC Col-0 vs. Col-0 Xray",111b,31410901,,64.3200000,,-0.1857606,0.0000000,NO,,1.0026364
LSSSPQCTLSGSSPPVGSLPK,ph,S,649,true,"atm callus - FC atm vs. atm Xray",111c,31410901,,64.3200000,,0.6479885,0.0000000,NO,,1.0026364
LSSSPQCTLSGSSPPVGSLPK,ph,S,649,true,"atm-3 X-ray callus - FC atm vs. atm Xray",111d,31410901,,64.3200000,,0.6479885,0.0000000,NO,,1.0026364
LSSSPQCTLSGSSPPVGSLPK,ph,S,649,true,"Tissue atlas Arabidopsis - ProteomicsDB",114,32188942,"MaxQuant score",297.9100000,1.0000000,,,,0,
