Peptide,PTM,ModifiedAA,ModifiedPosition,PeptideUniqueToGene,ExperimentDesc,ExpID,PubmedID,ScoreType,IdentScore,LocProb,Log2FChange,PQ-val,QuantSig,PEP,MassErrorPPM
SESVIQGSNPDR,nt,S,2,true,"Arg/N-end rule seed, prt6 vs. Wt",99,29168982,"MASCOT Score",75.1000000,,,,,0.003578000003472,-1.0599998
SESVIQGSNPDR,nta,S,2,true,"Arg/N-end rule seed, prt6 vs. Wt",99,29168982,"MASCOT Score",75.1000000,,,,,0.003578000003472,-1.0599998
SESVIQGSNPDR,nta,S,2,true,"Arabidopsis translation initiation landscape - NTA",167a,35069635,,,,,,,,
SESVIQGSNPDR,ph,S,2,true,"atm and atr DNA damage response",88,25561503,"MASCOT Score",46.0000000,1.0000000,,,,,0.6300000
SESVIQGSNPDR,ph,S,2,true,"Tissue atlas Arabidopsis - ProteomicsDB",114,32188942,"MaxQuant score",158.8600000,0.9768750,,,,2.0882799656174E-10,
VLSPTSSK,ph,S,16,true,"atm and atr DNA damage response",88,25561503,"MASCOT Score",32.0000000,0.9330000,,,,,-1.2800000
VLSPTSSK,ph,S,16,true,"Tissue atlas Arabidopsis - ProteomicsDB",114,32188942,"MaxQuant score",164.6500000,0.9998600,,,,3.3023198532679E-30,
AVAGHEEGSNSTGGAK,ph,S,378,true,"atm and atr DNA damage response",88,25561503,"MASCOT Score",31.0000000,1.0000000,,,,,-0.8600000
AVAGHEEGSNSTGGAK,ph,S,380,true,"atm and atr DNA damage response",88,25561503,"MASCOT Score",58.0000000,0.9450000,,,,,0.4200000
AVAGHEEGSNSTGGAK,ph,S,380,true,"Tissue atlas Arabidopsis - ProteomicsDB",114,32188942,"MaxQuant score",172.1200000,0.8942120,,,,2.4812300939657E-19,
AVAGHEEGSNSTGGAK,ph,T,381,true,"atm and atr DNA damage response",88,25561503,"MASCOT Score",31.0000000,1.0000000,,,,,-0.8600000
SQSVWAQLSDGGGDTTSR,ph,S,386,true,"Tissue atlas Arabidopsis - ProteomicsDB",114,32188942,"MaxQuant score",138.4700000,0.8333150,,,,5.8140997950069E-15,
SQSVWAQLSDGGGDTTSR,ph,S,388,true,"Conserved plant phosphoproteome - Arabidopsis",61a,20466843,"MASCOT Score",82.0000000,1.0000000,,,,,
SQSVWAQLSDGGGDTTSR,ph,S,394,true,"srk2dei ABA signaling phopshoproteomics",83,23572148,"MASCOT Score",53.0000000,,,,,,-0.0012000
SQSVWAQLSDGGGDTTSR,ph,S,394,true,"SnRK2 protein kinase substrates",85,23776212,XCorr,3.6880829,1.0000000,,,,2.5300700144726E-5,
SQSVWAQLSDGGGDTTSR,ph,S,394,true,"TOR Kinase and ABA Receptor",100,29290610,XCorr,4.2853332,0.9992000,,,,6.1219999736295E-8,
SQSVWAQLSDGGGDTTSR,ph,S,394,true,"Lateral root-induction - NAA vs control",106,23328941,"MASCOT Score",39.0000000,,,,,,
SQSVWAQLSDGGGDTTSR,ph,S,394,true,"Phospho cell culture sucrose/TOR",109,30833711,,,0.8809510,,,,,
SQSVWAQLSDGGGDTTSR,ph,S,394,true,"Col-0 callus - FC Col-0 vs. Col-0 Xray",111a,31410901,,48.7400000,,0.7626553,0.0000000,NO,,1.6937034
SQSVWAQLSDGGGDTTSR,ph,S,394,true,"Col-0 X-ray callus - FC Col-0 vs. Col-0 Xray",111b,31410901,,48.7400000,,0.7626553,0.0000000,NO,,1.6937034
SQSVWAQLSDGGGDTTSR,ph,S,394,true,"atm callus - FC atm vs. atm Xray",111c,31410901,,48.7400000,,0.3497738,0.0000000,NO,,1.6937034
SQSVWAQLSDGGGDTTSR,ph,S,394,true,"atm-3 X-ray callus - FC atm vs. atm Xray",111d,31410901,,48.7400000,,0.3497738,0.0000000,NO,,1.6937034
SQSVWAQLSDGGGDTTSR,ph,S,394,true,"Tissue atlas Arabidopsis - ProteomicsDB",114,32188942,"MaxQuant score",254.7100000,0.9994520,,,,0,
