Peptide,PTM,ModifiedAA,ModifiedPosition,PeptideUniqueToGene,ExperimentDesc,ExpID,PubmedID,ScoreType,IdentScore,LocProb,Log2FChange,PQ-val,QuantSig,PEP,MassErrorPPM
ADEINEIREE,nt,A,2,true,"N-term acetylation drought responses",5,26184543,,,,,,,,
ADEINEIR,nt,A,2,true,"Arg/N-end rule seed, prt6 vs. Wt",99,29168982,"MASCOT Score",69.8700000,,-0.0269814,0.8831856,NO,0.045279998332262,-0.2553326
ADEINEIREE,nta,A,2,true,"N-term acetylation drought responses",5,26184543,,,,,,,,
ADEINEIR,nta,A,2,true,"Characterization plant N-terminal acetylation",6,22223895,"MASCOT Score",59.1300000,,,,,,
ADEINEIR,nta,A,2,true,"Arg/N-end rule seed, prt6 vs. Wt",99,29168982,"MASCOT Score",69.8700000,,,,,0.045279998332262,-0.2553326
ADEINEIR,nta,A,2,true,"HUNTER N-terminome: legumain, GluC and trypsin",119,31951383,"MaxQuant score",98.6290000,,,,,,
EEQEQLAPFDPSKK,ph,S,21,true,"Tissue atlas Arabidopsis - ProteomicsDB",114,32188942,"MaxQuant score",88.3110000,1.0000000,,,,0.00020472900359891,
VVIQEPVEDLAESSQTEK,ph,S,41,true,"Tissue atlas Arabidopsis - ProteomicsDB",114,32188942,"MaxQuant score",274.6800000,0.7687200,,,,0,
KVVIQEPVEDLAESSQTEK,ph,S,42,true,"Tissue atlas Arabidopsis - ProteomicsDB",114,32188942,"MaxQuant score",310.2300000,0.9274150,,,,0,
VVIQEPVEDLAESSQTEK,ph,S,42,true,"Conserved plant phosphoproteome - Arabidopsis",61a,20466843,"MASCOT Score",79.0000000,1.0000000,,,,,
VVIQEPVEDLAESSQTEK,ph,S,42,true,"srk2dei ABA signaling phopshoproteomics",83,23572148,"MASCOT Score",50.0000000,,,,,,0.0016000
VVIQEPVEDLAESSQTEK,ph,S,42,true,"LAXIC - ABA stress",84a,23660473,XCorr,3.8700000,0.9910000,,,,1.3200000239522E-6,
VVIQEPVEDLAESSQTEK,ph,S,42,true,"LAXIC - mannitol vs control",84b,23660473,XCorr,4.7800000,0.9970000,,,,7.0700002652302E-7,
VVIQEPVEDLAESSQTEK,ph,S,42,true,"atm and atr DNA damage response",88,25561503,"MASCOT Score",44.0000000,1.0000000,,,,,0.2600000
VVIQEPVEDLAESSQTEK,ph,S,42,true,"TOR Kinase and ABA Receptor",100,29290610,XCorr,5.7628365,0.9444000,,,,1.3630000239573E-7,
VVIQEPVEDLAESSQTEK,ph,T,44,true,"srk2dei ABA signaling phopshoproteomics",83,23572148,"MASCOT Score",53.0000000,,,,,,0.0019000
VVIQEPVEDLAESSQTEK,ph,T,44,true,"SnRK2 protein kinase substrates",85,23776212,XCorr,3.0076172,0.9320000,,,,4.6758801691693E-11,
VVIQEPVEDLAESSQTEK,ph,T,44,true,"Tissue atlas Arabidopsis - ProteomicsDB",114,32188942,"MaxQuant score",255.2200000,0.8638770,,,,0,
SDSLPVNDGLESSFTGMK,ph,S,49,true,"TOR Kinase and ABA Receptor",100,29290610,XCorr,3.0867856,0.8788000,,,,0.017119999974966,
SDSLPVNDGLESSFTGMK,ph,S,49,true,"Phospho cell culture sucrose/TOR",109,30833711,,,0.8041520,,,,,
SDSLPVNDGLESSFTGMK,ph,S,49,true,"Tissue atlas Arabidopsis - ProteomicsDB",114,32188942,"MaxQuant score",189.8400000,0.9987640,,,,1.4012984643248E-45,
SDSLPVNDGLESSFTGMKK,ph,S,58,true,"Tissue atlas Arabidopsis - ProteomicsDB",114,32188942,"MaxQuant score",209.7000000,0.8571050,,,,0,
SDSLPVNDGLESSFTGMK,ph,S,59,true,"Tissue atlas Arabidopsis - ProteomicsDB",114,32188942,"MaxQuant score",236.2700000,0.8792060,,,,0,
SDSLPVNDGLESSFTGMK,ph,T,61,true,"Tissue atlas Arabidopsis - ProteomicsDB",114,32188942,"MaxQuant score",250.2000000,0.9919600,,,,0,
KKPTESSLLNNESVDAGEDLDEIANDEQEGEEGIVLQQR,ph,S,80,true,"Tissue atlas Arabidopsis - ProteomicsDB",114,32188942,"MaxQuant score",243.4600000,0.9989530,,,,0,
TVFVNFMDLCK,so,C,167,true,"S-sulfenylation site detection using YAP1C",110,32714340,,,,,,,,
TVFVNFMDLCKTMHR,ub,K,168,true,"upl3 mutant / wildtype",168,35926874,"MaxQuant score",63.6820000,1.0000000,-0.6943213,,,0.00023276900174096,0.5641900
QPDHVMQYLLAELGTSGSLDGQQR,nt,Q,173,true,"HUNTER N-terminome: legumain, GluC and trypsin",119,31951383,"MaxQuant score",95.9260000,,,,,,
FAPKNFEGILR,ac,K,206,true,"Quantitative Acetylproteomics",101,29440448,,,,,,,,
FAPKNFEGILR,ub,K,206,true,"Arabidopsis ubiquitination COFRADIC",40,26744219,"MaxQuant Score",60.2550000,1.0000000,,,,0.0010000000474975,0.5870000
FAPKNFEGILR,ub,K,206,true,"upl3 mutant / wildtype",168,35926874,"MaxQuant score",112.1300000,1.0000000,0.6257381,0.6514400,NO,3.5133398341713E-5,0.6426000
SPDTILSK,ph,S,227,true,"atm and atr DNA damage response",88,25561503,"MASCOT Score",30.0000000,1.0000000,,,,,-1.3900000
SVAPIKTGFVAR,nt,S,251,true,"Arabidopsis translation initiation landscape - NT",167b,35069635,,,,,,,,
SVAPIKTGFVAR,ub,K,256,true,"Arabidopsis ubiquitination COFRADIC",40,26744219,"MaxQuant Score",48.5680000,1.0000000,,,,0.013000000268221,0.4570000
