Peptide,PTM,ModifiedAA,ModifiedPosition,PeptideUniqueToGene,ExperimentDesc,ExpID,PubmedID,ScoreType,IdentScore,LocProb,Log2FChange,PQ-val,QuantSig,PEP,MassErrorPPM
TKVKDEPR,nt,T,2,true,"Arabidopsis translation initiation landscape - NT",167b,35069635,,,,,,,,
NSTSISPVSSPALNR,ph,S,95,true,"Col-0 callus - FC Col-0 vs. Col-0 Xray",111a,31410901,,24.0300000,,-1.3677964,0.0000000,NO,,3.6586681
NSTSISPVSSPALNR,ph,S,95,true,"Col-0 X-ray callus - FC Col-0 vs. Col-0 Xray",111b,31410901,,24.0300000,,-1.3677964,0.0000000,NO,,3.6586681
NSTSISPVSSPALNR,ph,S,95,true,"atm callus - FC atm vs. atm Xray",111c,31410901,,24.0300000,,-2.1420521,0.0000000,NO,,3.6586681
NSTSISPVSSPALNR,ph,S,95,true,"atm-3 X-ray callus - FC atm vs. atm Xray",111d,31410901,,24.0300000,,-2.1420521,0.0000000,NO,,3.6586681
NSTSISPVSSPALNR,ph,S,95,true,"Tissue atlas Arabidopsis - ProteomicsDB",114,32188942,"MaxQuant score",257.4800000,0.9981980,,,,0,
NSTSISPVSSPALNR,ph,S,97,true,"Tyrosine phosphorylation in Arabidopsis",59,18463617,"MASCOT Score",62.0000000,,,,,,-1.1810420
NSTSISPVSSPALNR,ph,S,97,true,"srk2dei ABA signaling phopshoproteomics",83,23572148,"MASCOT Score",49.0000000,,,,,,-0.0016000
NSTSISPVSSPALNR,ph,S,97,true,"SnRK2 protein kinase substrates",85,23776212,XCorr,2.2092226,0.9850000,,,,2.7986299500071E-8,
NSTSISPVSSPALNR,ph,S,97,true,"atm and atr DNA damage response",88,25561503,"MASCOT Score",64.0000000,0.9970000,,,,,-0.0100000
NSTSISPVSSPALNR,ph,S,97,true,"Protein sumoylation and phosphorylation cross-talk",97,28419593,,,,,,,,
NSTSISPVSSPALNR,ph,S,97,true,"TOR Kinase and ABA Receptor",100,29290610,XCorr,4.0260725,0.9868000,,,,9.7450001703692E-6,
NSTSISPVSSPALNR,ph,S,97,true,"Lateral root-induction - NAA vs control",106,23328941,"MASCOT Score",69.0000000,,,,,,
NSTSISPVSSPALNR,ph,S,97,true,"Col-0 callus - FC Col-0 vs. Col-0 Xray",111a,31410901,,77.3700000,,-1.9282468,0.0000000,NO,,0.8465208
NSTSISPVSSPALNR,ph,S,97,true,"Col-0 X-ray callus - FC Col-0 vs. Col-0 Xray",111b,31410901,,77.3700000,,-1.9282468,0.0000000,NO,,0.8465208
NSTSISPVSSPALNR,ph,S,97,true,"atm callus - FC atm vs. atm Xray",111c,31410901,,77.3700000,,-1.5580669,0.0000000,NO,,0.8465208
NSTSISPVSSPALNR,ph,S,97,true,"atm-3 X-ray callus - FC atm vs. atm Xray",111d,31410901,,77.3700000,,-1.5580669,0.0000000,NO,,0.8465208
NSTSISPVSSPALNR,ph,S,97,true,"Tissue atlas Arabidopsis - ProteomicsDB",114,32188942,"MaxQuant score",281.8600000,0.9997790,,,,0,
NSTSISPVSSPALNR,ph,S,97,true,"Touch-induced phosphorylation: 40s touch vs untouc",136,30291188,"MASCOT score",102.1000000,,0.0968978,0.8055631,NO,,1.3271728
NSTSISPVSSPALNR,ph,S,100,true,"Tissue atlas Arabidopsis - ProteomicsDB",114,32188942,"MaxQuant score",154.4600000,0.8182120,,,,4.1342701831426E-12,
NSTSISPVSSPALNR,ph,S,101,true,"atm and atr DNA damage response",88,25561503,"MASCOT Score",64.0000000,0.9500000,,,,,-0.0100000
NSTSISPVSSPALNR,ph,S,101,true,"Col-0 callus - FC Col-0 vs. Col-0 Xray",111a,31410901,,74.8600000,,4.8436291,0.0000000,NO,,1.3233759
NSTSISPVSSPALNR,ph,S,101,true,"Col-0 X-ray callus - FC Col-0 vs. Col-0 Xray",111b,31410901,,74.8600000,,4.8436291,0.0000000,NO,,1.3233759
NSTSISPVSSPALNR,ph,S,101,true,"atm callus - FC atm vs. atm Xray",111c,31410901,,74.8600000,,-2.9790627,0.0000000,NO,,1.3233759
NSTSISPVSSPALNR,ph,S,101,true,"atm-3 X-ray callus - FC atm vs. atm Xray",111d,31410901,,74.8600000,,-2.9790627,0.0000000,NO,,1.3233759
NSTSISPVSSPALNR,ph,S,101,true,"Tissue atlas Arabidopsis - ProteomicsDB",114,32188942,"MaxQuant score",210.1200000,0.9811740,,,,1.4012984643248E-45,
NPYPTSDFKK,ub,K,169,true,"upl3 mutant / wildtype",168,35926874,"MaxQuant score",86.8980000,1.0000000,-0.2108968,0.6066000,NO,0.0096298195421696,0.3518400
KTDVPTGNVSIKEEFPTA,sumo,K,181,true,"SUMO Ligase SIZ1 heat stress",4,29588388,,,,,,,,
