Peptide,PTM,ModifiedAA,ModifiedPosition,PeptideUniqueToGene,ExperimentDesc,ExpID,PubmedID,ScoreType,IdentScore,LocProb,Log2FChange,PQ-val,QuantSig,PEP,MassErrorPPM
GSIPLFWSQETSRMK,ph,S,300,true,"SIRK1 phosphorylation",86a,23820729,"MaxQuant Score",131.3100000,1.0000000,,,,0.0089999996125698,6.2270000
AATQSQEFLR,ph,S,572,false,"Tissue atlas Arabidopsis - ProteomicsDB",114,32188942,"MaxQuant score",160.9100000,1.0000000,,,,5.759579835285E-7,
SGEISMGEDEK,ph,S,625,true,"Tissue atlas Arabidopsis - ProteomicsDB",114,32188942,"MaxQuant score",72.2900000,0.9999790,,,,0.0023283399641514,
RCLSDGNILHESHTPMSAMSR,ph,S,643,true,"TOR Kinase and ABA Receptor",100,29290610,XCorr,2.9115844,0.9979000,,,,0.0010059999767691,
CLSDGNILHESHTPMSAMSR,ph,S,643,true,"atm and atr DNA damage response",88,25561503,"MASCOT Score",31.0000000,1.0000000,,,,,0.0200000
CLSDGNILHESHTPMSAMSR,ph,S,643,true,"Tissue atlas Arabidopsis - ProteomicsDB",114,32188942,"MaxQuant score",131.0400000,1.0000000,,,,1.0640800104991E-21,
KNESISHR,ph,S,664,true,"atm and atr DNA damage response",88,25561503,"MASCOT Score",46.0000000,0.9440000,,,,,-1.6600000
GFVSSHQVTR,ph,S,672,true,"Tissue atlas Arabidopsis - ProteomicsDB",114,32188942,"MaxQuant score",127.1700000,0.9808610,,,,8.5520303400699E-5,
THIISESSPDMPAAGDVTLSR,ph,S,685,true,"Tissue atlas Arabidopsis - ProteomicsDB",114,32188942,"MaxQuant score",262.9800000,0.9974510,,,,0,
